Project

General

Profile

build.log

PureTryOut, 06/27/2019 06:32 PM

 
1
'/home/builder/.abuild/-5d0b6539.rsa.pub' -> '/etc/apk/keys/-5d0b6539.rsa.pub'
2
fetch http://dl-cdn.alpinelinux.org/alpine/edge/main/x86_64/APKINDEX.tar.gz
3
fetch http://dl-cdn.alpinelinux.org/alpine/edge/community/x86_64/APKINDEX.tar.gz
4
fetch http://dl-cdn.alpinelinux.org/alpine/edge/testing/x86_64/APKINDEX.tar.gz
5
WARNING: Ignoring /home/builder/packages/main/x86_64/APKINDEX.tar.gz: No such file or directory
6
WARNING: Ignoring /home/builder/packages/community/x86_64/APKINDEX.tar.gz: No such file or directory
7
Upgrading critical system libraries and apk-tools:
8
(1/1) Upgrading apk-tools (2.10.3-r1 -> 2.10.4-r1)
9
7  0%                                             87100% ############################################8Executing busybox-1.30.1-r1.trigger
10
Continuing the upgrade transaction with new apk-tools:
11
WARNING: Ignoring /home/builder/packages/main/x86_64/APKINDEX.tar.gz: No such file or directory
12
WARNING: Ignoring /home/builder/packages/community/x86_64/APKINDEX.tar.gz: No such file or directory
13
(1/23) Upgrading musl (1.1.22-r0 -> 1.1.22-r2)
14
7  0%                                             8(2/23) Upgrading busybox (1.30.1-r1 -> 1.30.1-r2)
15
7  1%                                             87  3% #                                           8Executing busybox-1.30.1-r2.post-upgrade
16
(3/23) Upgrading alpine-baselayout (3.1.1-r0 -> 3.1.2-r0)
17
7  3% #                                           8Executing alpine-baselayout-3.1.2-r0.pre-upgrade
18
7  3% #                                           8Executing alpine-baselayout-3.1.2-r0.post-upgrade
19
(4/23) Upgrading openrc (0.41.2-r0 -> 0.41.2-r1)
20
7  4% #                                           87  4% ##                                          87  5% ##                                          87  6% ##                                          87  6% ###                                         87  7% ###                                         87  8% ###                                         87  9% ###                                         87  9% ####                                        8Executing openrc-0.41.2-r1.post-upgrade
21
(5/23) Upgrading alpine-conf (3.8.1-r5 -> 3.8.3-r0)
22
7  9% ####                                        8(6/23) Upgrading alpine-keys (2.1-r1 -> 2.1-r2)
23
7  9% ####                                        87 10% ####                                        8(7/23) Upgrading sudo (1.8.25_p1-r2 -> 1.8.27-r0)
24
7 10% ####                                        87 11% #####                                       87 12% #####                                       8(8/23) Upgrading libcrypto1.1 (1.1.1b-r1 -> 1.1.1c-r0)
25
7 12% #####                                       87 17% #######                                     87 18% #######                                     87 18% ########                                    8(9/23) Upgrading libssl1.1 (1.1.1b-r1 -> 1.1.1c-r0)
26
7 18% ########                                    8(10/23) Upgrading ssl_client (1.30.1-r1 -> 1.30.1-r2)
27
7 19% ########                                    8(11/23) Upgrading openssl (1.1.1b-r1 -> 1.1.1c-r0)
28
7 19% ########                                    8(12/23) Upgrading musl-utils (1.1.22-r0 -> 1.1.22-r2)
29
7 21% #########                                   8(13/23) Upgrading libattr (2.4.47-r7 -> 2.4.48-r0)
30
7 21% #########                                   8(14/23) Upgrading attr (2.4.47-r7 -> 2.4.48-r0)
31
7 21% #########                                   8(15/23) Upgrading nghttp2-libs (1.38.0-r0 -> 1.39.1-r0)
32
7 21% #########                                   8(16/23) Upgrading libcurl (7.64.1-r3 -> 7.65.1-r0)
33
7 21% #########                                   8(17/23) Upgrading curl (7.64.1-r3 -> 7.65.1-r0)
34
7 22% ##########                                  8(18/23) Upgrading abuild (3.4.0_rc4-r0 -> 3.4.0-r0)
35
7 23% ##########                                  8Executing abuild-3.4.0-r0.pre-upgrade
36
7 23% ##########                                  8(19/23) Upgrading binutils (2.31.1-r2 -> 2.32-r0)
37
7 24% ##########                                  87 26% ###########                                 87 29% #############                               87 30% #############                               87 31% #############                               87 35% ###############                             87 36% ################                            87 37% ################                            87 40% #################                           87 42% ##################                          87 43% ##################                          87 43% ###################                         87 44% ###################                         87 45% ###################                         87 45% ####################                        87 46% ####################                        8(20/23) Upgrading musl-dev (1.1.22-r0 -> 1.1.22-r2)
38
7 46% ####################                        87 50% ######################                      87 55% ########################                    87 59% ##########################                  87 64% ############################                87 67% #############################               87 68% #############################               87 68% ##############################              87 69% ##############################              8(21/23) Upgrading fortify-headers (1.0-r1 -> 1.1-r0)
39
7 69% ##############################              8(22/23) Upgrading expat (2.2.6-r0 -> 2.2.7-r0)
40
7 70% ##############################              8(23/23) Upgrading git (2.21.0-r3 -> 2.22.0-r0)
41
7 70% ##############################              87 74% ################################            87 75% #################################           87 78% ##################################          87 81% ###################################         87 81% ####################################        87 84% #####################################       87 87% ######################################      87 90% #######################################     87 93% #########################################   87 96% ##########################################  87 99% ########################################### 87100% ############################################8Executing busybox-1.30.1-r2.trigger
42
Executing ca-certificates-20190108-r0.trigger
43
OK: 185 MiB in 54 packages
44
]0;abuild: dolphin-emu>>> dolphin-emu: Building testing/dolphin-emu 0_git20190626-r0 (using abuild 3.4.0-r0) started Thu, 27 Jun 2019 18:29:55 +0000
45
>>> dolphin-emu: Checking sanity of /home/builder/aports/testing/dolphin-emu/APKBUILD...
46
>>> dolphin-emu: Analyzing dependencies...
47
7  0%                                             87  1%                                             87  2%                                             87  8% ###                                         87  9% ####                                        87 10% ####                                        87 11% ####                                        87 11% #####                                       87 12% #####                                       87 13% #####                                       87 24% ##########                                  87 25% ###########                                 87 26% ###########                                 87 27% ############                                87 28% ############                                87 29% ############                                87 29% #############                               87 30% #############                               87 31% #############                               87 32% ##############                              87 37% ################                            87 38% ################                            87 38% #################                           87 39% #################                           87 40% #################                           87 45% ###################                         87 45% ####################                        87 46% ####################                        87 58% #########################                   87 59% #########################                   87 59% ##########################                  87 60% ##########################                  87 64% ############################                87 65% ############################                87 66% #############################               87 75% #################################           87 82% ####################################        87 84% #####################################       87 85% #####################################       87 86% #####################################       87 86% ######################################      87 90% #######################################     87 99% ########################################### 87100% ############################################8>>> dolphin-emu: Installing for build: build-base cmake ninja mesa-dev mesa-egl ffmpeg-dev libevdev-dev eudev-dev pugixml-dev zlib-dev lzo-dev libpng-dev sfml-dev libusb-dev miniupnpc-dev mbedtls-dev curl-dev hidapi-dev libx11-dev qt5-qtbase-dev libxi-dev bluez-dev pulseaudio-dev
48
WARNING: Ignoring /home/builder/packages/main/x86_64/APKINDEX.tar.gz: No such file or directory
49
WARNING: Ignoring /home/builder/packages/community/x86_64/APKINDEX.tar.gz: No such file or directory
50
(1/204) Installing libacl (2.2.52-r6)
51
7  0%                                             8(2/204) Installing libbz2 (1.0.6-r6)
52
7  0%                                             8(3/204) Installing lz4-libs (1.9.1-r0)
53
7  0%                                             8(4/204) Installing xz-libs (5.2.4-r0)
54
7  0%                                             8(5/204) Installing libarchive (3.3.3-r0)
55
7  0%                                             8(6/204) Installing ncurses-terminfo-base (6.1_p20190518-r0)
56
7  0%                                             8(7/204) Installing ncurses-terminfo (6.1_p20190518-r0)
57
7  0%                                             87  1%                                             8(8/204) Installing ncurses-libs (6.1_p20190518-r0)
58
7  1%                                             8(9/204) Installing rhash-libs (1.3.8-r0)
59
7  1%                                             8(10/204) Installing libuv (1.29.1-r0)
60
7  1%                                             87  2%                                             8(11/204) Installing cmake (3.14.5-r0)
61
7  2%                                             87  2% #                                           87  3% #                                           87  4% #                                           87  4% ##                                          87  5% ##                                          87  6% ##                                          87  6% ###                                         87  7% ###                                         8(12/204) Installing ninja (1.9.0-r1)
62
7  8% ###                                         8(13/204) Installing linux-headers (4.19.36-r0)
63
7  8% ###                                         87  9% ###                                         87  9% ####                                        8(14/204) Installing libpciaccess (0.14-r0)
64
7  9% ####                                        8(15/204) Installing libdrm (2.4.98-r0)
65
7  9% ####                                        8(16/204) Installing libdrm-dev (2.4.98-r0)
66
7  9% ####                                        8(17/204) Installing libxau (1.0.9-r0)
67
7  9% ####                                        8(18/204) Installing xorgproto (2018.4-r0)
68
7  9% ####                                        87 10% ####                                        8(19/204) Installing libxau-dev (1.0.9-r0)
69
7 10% ####                                        8(20/204) Installing libbsd (0.9.1-r0)
70
7 10% ####                                        8(21/204) Installing libxdmcp (1.1.3-r0)
71
7 10% ####                                        8(22/204) Installing libxcb (1.13.1-r0)
72
7 10% ####                                        8(23/204) Installing libx11 (1.6.8-r0)
73
7 10% ####                                        87 11% ####                                        8(24/204) Installing libxext (1.3.4-r0)
74
7 11% ####                                        8(25/204) Installing xcb-proto (1.13-r3)
75
7 11% ####                                        87 11% #####                                       8(26/204) Installing libpthread-stubs (0.3-r5)
76
7 11% #####                                       8(27/204) Installing libxdmcp-dev (1.1.3-r0)
77
7 11% #####                                       8(28/204) Installing libxcb-dev (1.13.1-r0)
78
7 11% #####                                       87 12% #####                                       8(29/204) Installing xtrans (1.4.0-r0)
79
7 12% #####                                       8(30/204) Installing libx11-dev (1.6.8-r0)
80
7 12% #####                                       8(31/204) Installing libxext-dev (1.3.4-r0)
81
7 12% #####                                       8(32/204) Installing libxdamage (1.1.5-r0)
82
7 12% #####                                       8(33/204) Installing libxfixes (5.0.3-r2)
83
7 12% #####                                       8(34/204) Installing libxfixes-dev (5.0.3-r2)
84
7 12% #####                                       8(35/204) Installing libxdamage-dev (1.1.5-r0)
85
7 12% #####                                       8(36/204) Installing libxshmfence (1.3-r0)
86
7 12% #####                                       8(37/204) Installing libxshmfence-dev (1.3-r0)
87
7 12% #####                                       8(38/204) Installing mesa (19.1.1-r0)
88
7 12% #####                                       8(39/204) Installing libffi (3.2.1-r6)
89
7 12% #####                                       8(40/204) Installing wayland-libs-server (1.17.0-r0)
90
7 12% #####                                       8(41/204) Installing mesa-gbm (19.1.1-r0)
91
7 12% #####                                       8(42/204) Installing mesa-glapi (19.1.1-r0)
92
7 12% #####                                       8(43/204) Installing wayland-libs-client (1.17.0-r0)
93
7 12% #####                                       8(44/204) Installing mesa-egl (19.1.1-r0)
94
7 12% #####                                       8(45/204) Installing libxxf86vm (1.1.4-r2)
95
7 12% #####                                       8(46/204) Installing mesa-gl (19.1.1-r0)
96
7 12% #####                                       8(47/204) Installing mesa-gles (19.1.1-r0)
97
7 12% #####                                       8(48/204) Installing libxml2 (2.9.9-r2)
98
7 12% #####                                       8(49/204) Installing llvm8-libs (8.0.0-r1)
99
7 13% #####                                       87 13% ######                                      87 14% ######                                      87 15% ######                                      87 16% #######                                     87 17% #######                                     87 18% #######                                     87 18% ########                                    87 19% ########                                    87 20% ########                                    87 20% #########                                   87 21% #########                                   87 22% #########                                   87 22% ##########                                  87 23% ##########                                  87 24% ##########                                  8(50/204) Installing mesa-osmesa (19.1.1-r0)
100
7 24% ##########                                  87 25% ###########                                 8(51/204) Installing mesa-xatracker (19.1.1-r0)
101
7 25% ###########                                 87 26% ###########                                 8(52/204) Installing libxxf86vm-dev (1.1.4-r2)
102
7 26% ###########                                 8(53/204) Installing mesa-dev (19.1.1-r0)
103
7 26% ###########                                 87 27% ###########                                 87 27% ############                                8(54/204) Installing sdl2 (2.0.9-r0)
104
7 27% ############                                8(55/204) Installing alsa-lib (1.1.9-r0)
105
7 27% ############                                87 28% ############                                8(56/204) Installing libpng (1.6.37-r1)
106
7 28% ############                                8(57/204) Installing freetype (2.10.0-r0)
107
7 28% ############                                8(58/204) Installing libuuid (2.33.2-r0)
108
7 28% ############                                8(59/204) Installing fontconfig (2.13.1-r0)
109
7 28% ############                                8(60/204) Installing fribidi (1.0.5-r1)
110
7 28% ############                                8(61/204) Installing libass (0.14.0-r0)
111
7 28% ############                                8(62/204) Installing nettle (3.4.1-r1)
112
7 28% ############                                8(63/204) Installing p11-kit (0.23.16.1-r0)
113
7 28% ############                                8(64/204) Installing libtasn1 (4.13-r0)
114
7 28% ############                                87 29% ############                                8(65/204) Installing libunistring (0.9.10-r0)
115
7 29% ############                                8(66/204) Installing gnutls (3.6.8-r0)
116
7 29% ############                                8(67/204) Installing lame (3.100-r0)
117
7 29% #############                               8(68/204) Installing opus (1.3.1-r0)
118
7 29% #############                               8(69/204) Installing libogg (1.3.3-r2)
119
7 29% #############                               8(70/204) Installing libtheora (1.1.1-r14)
120
7 29% #############                               87 30% #############                               8(71/204) Installing libjpeg-turbo (2.0.2-r0)
121
7 30% #############                               8(72/204) Installing v4l-utils-libs (1.16.6-r0)
122
7 30% #############                               8(73/204) Installing libva (2.4.1-r0)
123
7 30% #############                               8(74/204) Installing libvdpau (1.2-r0)
124
7 30% #############                               8(75/204) Installing libvorbis (1.3.6-r2)
125
7 30% #############                               8(76/204) Installing libvpx (1.8.0-r0)
126
7 30% #############                               87 31% #############                               8(77/204) Installing x264-libs (20180304-r1)
127
7 31% #############                               8(78/204) Installing x265-libs (3.0-r0)
128
7 31% #############                               87 31% ##############                              87 32% ##############                              8(79/204) Installing xvidcore (1.3.4-r1)
129
7 32% ##############                              8(80/204) Installing ffmpeg-libs (4.1.3-r1)
130
7 32% ##############                              87 33% ##############                              87 34% ###############                             87 35% ###############                             87 36% ###############                             87 36% ################                            87 37% ################                            8(81/204) Installing ffmpeg-dev (4.1.3-r1)
131
7 37% ################                            8(82/204) Installing libevdev (1.6.0-r0)
132
7 37% ################                            8(83/204) Installing libevdev-dev (1.6.0-r0)
133
7 37% ################                            8(84/204) Installing udev-init-scripts (32-r2)
134
7 37% ################                            8Executing udev-init-scripts-32-r2.post-install
135
(85/204) Installing eudev-libs (3.2.8-r0)
136
7 37% ################                            8(86/204) Installing libblkid (2.33.2-r0)
137
7 37% ################                            8(87/204) Installing kmod (24-r1)
138
7 37% ################                            8(88/204) Installing eudev (3.2.8-r0)
139
7 37% ################                            87 38% ################                            8(89/204) Installing eudev-dev (3.2.8-r0)
140
7 38% ################                            8(90/204) Installing pugixml (1.9-r0)
141
7 38% ################                            8(91/204) Installing pugixml-dev (1.9-r0)
142
7 38% ################                            8(92/204) Installing zlib-dev (1.2.11-r1)
143
7 38% ################                            8(93/204) Installing lzo (2.10-r2)
144
7 38% ################                            8(94/204) Installing lzo-dev (2.10-r2)
145
7 38% ################                            8(95/204) Installing libpng-dev (1.6.37-r1)
146
7 38% ################                            8(96/204) Installing flac (1.3.2-r2)
147
7 38% ################                            8(97/204) Installing libogg-dev (1.3.3-r2)
148
7 38% ################                            8(98/204) Installing flac-dev (1.3.2-r2)
149
7 38% ################                            87 38% #################                           8(99/204) Installing freetype-dev (2.10.0-r0)
150
7 38% #################                           8(100/204) Installing alsa-lib-dev (1.1.9-r0)
151
7 38% #################                           87 39% #################                           8(101/204) Installing openal-soft (1.19.1-r1)
152
7 39% #################                           8(102/204) Installing openal-soft-dev (1.19.1-r1)
153
7 39% #################                           8(103/204) Installing libvorbis-dev (1.3.6-r2)
154
7 39% #################                           8(104/204) Installing libxrender (0.9.10-r3)
155
7 39% #################                           8(105/204) Installing libxrandr (1.5.2-r0)
156
7 39% #################                           8(106/204) Installing sfml (2.5.1-r0)
157
7 39% #################                           8(107/204) Installing sfml-dev (2.5.1-r0)
158
7 39% #################                           87 40% #################                           8(108/204) Installing libusb (1.0.22-r1)
159
7 40% #################                           8(109/204) Installing libusb-dev (1.0.22-r1)
160
7 40% #################                           8(110/204) Installing miniupnpc (2.1.20190625-r0)
161
7 40% #################                           8(111/204) Installing miniupnpc-dev (2.1.20190625-r0)
162
7 40% #################                           8(112/204) Installing mbedtls (2.16.2-r0)
163
7 40% #################                           8(113/204) Installing mbedtls-dev (2.16.2-r0)
164
7 40% #################                           8(114/204) Installing openssl-dev (1.1.1c-r0)
165
7 40% #################                           87 41% ##################                          87 42% ##################                          87 43% ###################                         87 44% ###################                         87 45% ###################                         8(115/204) Installing nghttp2-dev (1.39.1-r0)
166
7 45% ###################                         8(116/204) Installing curl-dev (7.65.1-r0)
167
7 45% ###################                         8(117/204) Installing hidapi (0.9.0-r2)
168
7 45% ###################                         8(118/204) Installing hidapi-dev (0.9.0-r2)
169
7 45% ###################                         8(119/204) Installing libice (1.0.9-r3)
170
7 45% ###################                         8(120/204) Installing libice-dev (1.0.9-r3)
171
7 45% ###################                         8(121/204) Installing libsm (1.2.3-r0)
172
7 45% ###################                         8(122/204) Installing libsm-dev (1.2.3-r0)
173
7 45% ###################                         8(123/204) Installing expat-dev (2.2.7-r0)
174
7 45% ###################                         8(124/204) Installing libfdisk (2.33.2-r0)
175
7 45% ###################                         8(125/204) Installing libmount (2.33.2-r0)
176
7 45% ####################                        8(126/204) Installing libsmartcols (2.33.2-r0)
177
7 45% ####################                        8(127/204) Installing util-linux-dev (2.33.2-r0)
178
7 45% ####################                        87 46% ####################                        8(128/204) Installing fontconfig-dev (2.13.1-r0)
179
7 46% ####################                        8(129/204) Installing gdbm (1.13-r1)
180
7 46% ####################                        8(130/204) Installing readline (8.0.0-r0)
181
7 46% ####################                        8(131/204) Installing sqlite-libs (3.28.0-r0)
182
7 46% ####################                        8(132/204) Installing python3 (3.7.3-r0)
183
7 46% ####################                        87 47% ####################                        87 47% #####################                       87 48% #####################                       87 49% #####################                       87 50% ######################                      87 51% ######################                      87 52% ######################                      87 52% #######################                     87 53% #######################                     87 54% #######################                     87 54% ########################                    87 55% ########################                    87 56% ########################                    87 56% #########################                   87 57% #########################                   87 58% #########################                   8(133/204) Installing gettext-asprintf (0.19.8.1-r4)
184
7 58% #########################                   8(134/204) Installing libintl (0.19.8.1-r4)
185
7 58% #########################                   8(135/204) Installing gettext-libs (0.19.8.1-r4)
186
7 58% #########################                   8(136/204) Installing gettext (0.19.8.1-r4)
187
7 59% #########################                   87 59% ##########################                  8(137/204) Installing gettext-dev (0.19.8.1-r4)
188
7 59% ##########################                  8(138/204) Installing bzip2-dev (1.0.6-r6)
189
7 59% ##########################                  8(139/204) Installing libffi-dev (3.2.1-r6)
190
7 59% ##########################                  8(140/204) Installing libxml2-utils (2.9.9-r2)
191
7 59% ##########################                  8(141/204) Installing libgpg-error (1.36-r2)
192
7 60% ##########################                  8(142/204) Installing libgcrypt (1.8.4-r1)
193
7 60% ##########################                  8(143/204) Installing libxslt (1.1.33-r1)
194
7 60% ##########################                  8(144/204) Installing docbook-xml (4.5-r6)
195
7 60% ##########################                  8Executing docbook-xml-4.5-r6.post-install
196
(145/204) Installing docbook-xsl (1.79.1-r1)
197
7 60% ##########################                  87 61% ##########################                  87 61% ###########################                 87 62% ###########################                 87 63% ###########################                 87 63% ############################                87 64% ############################                8Executing docbook-xsl-1.79.1-r1.post-install
198
(146/204) Installing pcre (8.43-r0)
199
7 64% ############################                8(147/204) Installing glib (2.60.4-r0)
200
7 64% ############################                87 65% ############################                8(148/204) Installing libpcre16 (8.43-r0)
201
7 65% ############################                8(149/204) Installing libpcre32 (8.43-r0)
202
7 65% ############################                8(150/204) Installing libpcrecpp (8.43-r0)
203
7 65% ############################                8(151/204) Installing pcre-dev (8.43-r0)
204
7 65% ############################                8(152/204) Installing glib-dev (2.60.4-r0)
205
7 65% ############################                87 65% #############################               87 66% #############################               8(153/204) Installing sqlite-dev (3.28.0-r0)
206
7 66% #############################               8(154/204) Installing dbus-libs (1.12.16-r0)
207
7 66% #############################               8(155/204) Installing dbus-dev (1.12.16-r0)
208
7 66% #############################               8(156/204) Installing perl (5.28.2-r1)
209
7 66% #############################               87 67% #############################               87 68% ##############################              87 69% ##############################              87 70% ##############################              87 70% ###############################             87 71% ###############################             87 72% ###############################             87 72% ################################            87 73% ################################            87 74% ################################            87 75% #################################           8(157/204) Installing icu-libs (64.2-r0)
210
7 75% #################################           87 76% #################################           87 77% ##################################          87 78% ##################################          87 79% ##################################          87 79% ###################################         87 80% ###################################         87 81% ###################################         87 81% ####################################        87 82% ####################################        8(158/204) Installing libpcre2-16 (10.33-r0)
211
7 82% ####################################        8(159/204) Installing qt5-qtbase (5.12.4-r1)
212
7 82% ####################################        87 83% ####################################        87 84% ####################################        87 84% #####################################       8(160/204) Installing qt5-qtbase-sqlite (5.12.4-r1)
213
7 84% #####################################       8(161/204) Installing unixodbc (2.3.7-r1)
214
7 84% #####################################       8(162/204) Installing qt5-qtbase-odbc (5.12.4-r1)
215
7 84% #####################################       8(163/204) Installing db (5.3.28-r1)
216
7 84% #####################################       8(164/204) Installing libsasl (2.1.27-r3)
217
7 84% #####################################       8(165/204) Installing libldap (2.4.47-r2)
218
7 85% #####################################       8(166/204) Installing libpq (11.3-r2)
219
7 85% #####################################       8(167/204) Installing qt5-qtbase-postgresql (5.12.4-r1)
220
7 85% #####################################       8(168/204) Installing mariadb-connector-c (3.0.10-r0)
221
7 85% #####################################       8(169/204) Installing qt5-qtbase-mysql (5.12.4-r1)
222
7 85% #####################################       8(170/204) Installing freetds (1.1.6-r0)
223
7 85% #####################################       8(171/204) Installing qt5-qtbase-tds (5.12.4-r1)
224
7 85% #####################################       8(172/204) Installing hicolor-icon-theme (0.17-r1)
225
7 85% #####################################       8(173/204) Installing avahi-libs (0.7-r1)
226
7 86% #####################################       8(174/204) Installing cups-libs (2.2.11-r0)
227
7 86% #####################################       8(175/204) Installing graphite2 (1.3.13-r1)
228
7 86% #####################################       8(176/204) Installing harfbuzz (2.5.2-r0)
229
7 86% #####################################       87 86% ######################################      8(177/204) Installing mtdev (1.1.5-r2)
230
7 86% ######################################      8(178/204) Installing libinput-libs (1.13.2-r0)
231
7 86% ######################################      8(179/204) Installing xcb-util-wm (0.4.1-r1)
232
7 86% ######################################      8(180/204) Installing xcb-util (0.4.0-r1)
233
7 86% ######################################      8(181/204) Installing xcb-util-image (0.4.0-r1)
234
7 86% ######################################      8(182/204) Installing xcb-util-keysyms (0.4.0-r1)
235
7 86% ######################################      8(183/204) Installing xcb-util-renderutil (0.3.9-r1)
236
7 86% ######################################      8(184/204) Installing libxkbcommon (0.8.4-r0)
237
7 86% ######################################      8(185/204) Installing libxkbcommon-x11 (0.8.4-r0)
238
7 86% ######################################      8(186/204) Installing qt5-qtbase-x11 (5.12.4-r1)
239
7 86% ######################################      87 87% ######################################      87 88% ######################################      87 88% #######################################     87 89% #######################################     87 90% #######################################     8(187/204) Installing qt5-qtbase-dev (5.12.4-r1)
240
7 90% #######################################     87 90% ########################################    87 91% ########################################    87 92% ########################################    87 93% #########################################   87 94% #########################################   87 95% #########################################   87 95% ##########################################  87 96% ##########################################  87 97% ##########################################  87 97% ########################################### 87 98% ########################################### 8(188/204) Installing libxi (1.7.10-r0)
241
7 99% ########################################### 8(189/204) Installing libxi-dev (1.7.10-r0)
242
7 99% ########################################### 8(190/204) Installing bluez-libs (5.50-r3)
243
7 99% ########################################### 8(191/204) Installing bluez-dev (5.50-r3)
244
7 99% ########################################### 8(192/204) Installing libltdl (2.4.6-r6)
245
7 99% ########################################### 8(193/204) Installing libsndfile (1.0.28-r8)
246
7 99% ########################################### 8(194/204) Installing speexdsp (1.2.0-r0)
247
7 99% ########################################### 8(195/204) Installing libpulse (12.2-r3)
248
7 99% ########################################### 8(196/204) Installing libpulse-mainloop-glib (12.2-r3)
249
7 99% ########################################### 8(197/204) Installing pulseaudio-dev (12.2-r3)
250
7 99% ########################################### 8(198/204) Installing .makedepends-dolphin-emu (20190627.182956)
251
7 99% ########################################### 8(199/204) Installing kmod-openrc (24-r1)
252
7 99% ########################################### 8(200/204) Installing udev-init-scripts-openrc (32-r2)
253
7 99% ########################################### 8(201/204) Installing eudev-openrc (3.2.8-r0)
254
7 99% ########################################### 8(202/204) Installing perl-error (0.17027-r0)
255
7 99% ########################################### 8(203/204) Installing perl-git (2.22.0-r0)
256
7 99% ########################################### 8(204/204) Installing git-perl (2.22.0-r0)
257
7 99% ########################################### 87100% ############################################8Executing busybox-1.30.1-r2.trigger
258
Executing glib-2.60.4-r0.trigger
259
No schema files found: doing nothing.
260
OK: 626 MiB in 258 packages
261
]0;>>> dolphin-emu: Cleaning up srcdir
262
]0;>>> dolphin-emu: Cleaning up pkgdir
263
>>> dolphin-emu: Fetching dolphin-emu-769ba43abf3afc0f65dfa610236636e80371d3ca.tar.gz::https://github.com/dolphin-emu/dolphin/archive/769ba43abf3afc0f65dfa610236636e80371d3ca.tar.gz
264
  % Total    % Received % Xferd  Average Speed   Time    Time     Time  Current
265
                                 Dload  Upload   Total   Spent    Left  Speed
266
  0     0    0     0    0     0      0      0 --:--:-- --:--:-- --:--:--     0
100   161    0   161    0     0    605      0 --:--:-- --:--:-- --:--:--   605
267
100   682    0   682    0     0    968      0 --:--:-- --:--:-- --:--:--   968
100 2402k    0 2402k    0     0  1441k      0 --:--:--  0:00:01 --:--:-- 2494k
100 6541k    0 6541k    0     0  2442k      0 --:--:--  0:00:02 --:--:-- 3313k
100 9356k    0 9356k    0     0   918k      0 --:--:--  0:00:10 --:--:--  986k
100 15.3M    0 15.3M    0     0  1464k      0 --:--:--  0:00:10 --:--:-- 1567k
100 20.2M    0 20.2M    0     0  1778k      0 --:--:--  0:00:11 --:--:-- 1892k
100 25.7M    0 25.7M    0     0  2078k      0 --:--:--  0:00:12 --:--:-- 2174k
100 31.1M    0 31.1M    0     0  2334k      0 --:--:--  0:00:13 --:--:-- 2308k
100 36.2M    0 36.2M    0     0  2528k      0 --:--:--  0:00:14 --:--:-- 6164k
100 37.7M    0 37.7M    0     0  2580k      0 --:--:--  0:00:14 --:--:-- 5374k
268
>>> dolphin-emu: Fetching dolphin-emu-769ba43abf3afc0f65dfa610236636e80371d3ca.tar.gz::https://github.com/dolphin-emu/dolphin/archive/769ba43abf3afc0f65dfa610236636e80371d3ca.tar.gz
269
>>> dolphin-emu: Checking sha512sums...
270
dolphin-emu-769ba43abf3afc0f65dfa610236636e80371d3ca.tar.gz: OK
271
fix-build.patch: OK
272
>>> dolphin-emu: Unpacking /var/cache/distfiles/dolphin-emu-769ba43abf3afc0f65dfa610236636e80371d3ca.tar.gz...
273
>>> dolphin-emu: fix-build.patch
274
patching file Source/Core/Core/HW/WiimoteReal/IOLinux.cpp
275
'Externals/Bochs_disasm' -> './Bochs_disasm'
276
'Externals/FreeSurround' -> './FreeSurround'
277
'Externals/cpp-optparse' -> './cpp-optparse'
278
'Externals/fmt' -> './fmt'
279
'Externals/glslang' -> './glslang'
280
'Externals/imgui' -> './imgui'
281
'Externals/xxhash' -> './xxhash'
282
'Externals/minizip' -> './minizip'
283
'Externals/soundtouch' -> './soundtouch'
284
'Externals/cubeb' -> './cubeb'
285
'Externals/gtest' -> './gtest'
286
'Externals/picojson' -> './picojson'
287
'Externals/enet' -> './enet'
288
'Bochs_disasm' -> 'Externals/Bochs_disasm'
289
'FreeSurround' -> 'Externals/FreeSurround'
290
'cpp-optparse' -> 'Externals/cpp-optparse'
291
'fmt' -> 'Externals/fmt'
292
'glslang' -> 'Externals/glslang'
293
'imgui' -> 'Externals/imgui'
294
'xxhash' -> 'Externals/xxhash'
295
'minizip' -> 'Externals/minizip'
296
'soundtouch' -> 'Externals/soundtouch'
297
'cubeb' -> 'Externals/cubeb'
298
'gtest' -> 'Externals/gtest'
299
'picojson' -> 'Externals/picojson'
300
'enet' -> 'Externals/enet'
301
-- The C compiler identification is GNU 8.3.0
302
-- The CXX compiler identification is GNU 8.3.0
303
-- Check for working C compiler: /usr/bin/gcc
304
-- Check for working C compiler: /usr/bin/gcc -- works
305
-- Detecting C compiler ABI info
306
-- Detecting C compiler ABI info - done
307
-- Detecting C compile features
308
-- Detecting C compile features - done
309
-- Check for working CXX compiler: /usr/bin/c++
310
-- Check for working CXX compiler: /usr/bin/c++ -- works
311
-- Detecting CXX compiler ABI info
312
-- Detecting CXX compiler ABI info - done
313
-- Detecting CXX compile features
314
-- Detecting CXX compile features - done
315
-- Found Git: /usr/bin/git (found version "2.22.0") 
316
-- Detected architecture: x86_64
317
-- Performing Test FLAG_C_HAVE_SSE2
318
-- Performing Test FLAG_C_HAVE_SSE2 - Success
319
-- Performing Test FLAG_CXX_HAVE_SSE2
320
-- Performing Test FLAG_CXX_HAVE_SSE2 - Success
321
-- Performing Test FLAG_C_DIAGNOSTICS_COLOR
322
-- Performing Test FLAG_C_DIAGNOSTICS_COLOR - Success
323
-- Performing Test FLAG_CXX_DIAGNOSTICS_COLOR
324
-- Performing Test FLAG_CXX_DIAGNOSTICS_COLOR - Success
325
-- Performing Test FLAG_C_HAVE_WALL
326
-- Performing Test FLAG_C_HAVE_WALL - Success
327
-- Performing Test FLAG_CXX_HAVE_WALL
328
-- Performing Test FLAG_CXX_HAVE_WALL - Success
329
-- Performing Test FLAG_C_TYPE_LIMITS
330
-- Performing Test FLAG_C_TYPE_LIMITS - Success
331
-- Performing Test FLAG_CXX_TYPE_LIMITS
332
-- Performing Test FLAG_CXX_TYPE_LIMITS - Success
333
-- Performing Test FLAG_C_SIGN_COMPARE
334
-- Performing Test FLAG_C_SIGN_COMPARE - Success
335
-- Performing Test FLAG_CXX_SIGN_COMPARE
336
-- Performing Test FLAG_CXX_SIGN_COMPARE - Success
337
-- Performing Test FLAG_C_IGNORED_QUALIFIERS
338
-- Performing Test FLAG_C_IGNORED_QUALIFIERS - Success
339
-- Performing Test FLAG_CXX_IGNORED_QUALIFIERS
340
-- Performing Test FLAG_CXX_IGNORED_QUALIFIERS - Success
341
-- Performing Test FLAG_C_UNINITIALIZED
342
-- Performing Test FLAG_C_UNINITIALIZED - Success
343
-- Performing Test FLAG_CXX_UNINITIALIZED
344
-- Performing Test FLAG_CXX_UNINITIALIZED - Success
345
-- Performing Test FLAG_C_LOGICAL_OP
346
-- Performing Test FLAG_C_LOGICAL_OP - Success
347
-- Performing Test FLAG_CXX_LOGICAL_OP
348
-- Performing Test FLAG_CXX_LOGICAL_OP - Success
349
-- Performing Test FLAG_C_SHADOW
350
-- Performing Test FLAG_C_SHADOW - Success
351
-- Performing Test FLAG_CXX_SHADOW
352
-- Performing Test FLAG_CXX_SHADOW - Success
353
-- Performing Test FLAG_C_INIT_SELF
354
-- Performing Test FLAG_C_INIT_SELF - Success
355
-- Performing Test FLAG_CXX_INIT_SELF
356
-- Performing Test FLAG_CXX_INIT_SELF - Success
357
-- Performing Test FLAG_C_MISSING_DECLARATIONS
358
-- Performing Test FLAG_C_MISSING_DECLARATIONS - Success
359
-- Performing Test FLAG_CXX_MISSING_DECLARATIONS
360
-- Performing Test FLAG_CXX_MISSING_DECLARATIONS - Success
361
-- Performing Test FLAG_C_MISSING_VARIABLE_DECLARATIONS
362
-- Performing Test FLAG_C_MISSING_VARIABLE_DECLARATIONS - Failed
363
-- Performing Test FLAG_CXX_MISSING_VARIABLE_DECLARATIONS
364
-- Performing Test FLAG_CXX_MISSING_VARIABLE_DECLARATIONS - Failed
365
-- Performing Test FLAG_C_NO_STRICT_ALIASING
366
-- Performing Test FLAG_C_NO_STRICT_ALIASING - Success
367
-- Performing Test FLAG_CXX_NO_STRICT_ALIASING
368
-- Performing Test FLAG_CXX_NO_STRICT_ALIASING - Success
369
-- Performing Test FLAG_C_NO_EXCEPTIONS
370
-- Performing Test FLAG_C_NO_EXCEPTIONS - Success
371
-- Performing Test FLAG_CXX_NO_EXCEPTIONS
372
-- Performing Test FLAG_CXX_NO_EXCEPTIONS - Success
373
-- Performing Test FLAG_C_VISIBILITY_INLINES_HIDDEN
374
-- Performing Test FLAG_C_VISIBILITY_INLINES_HIDDEN - Failed
375
-- Performing Test FLAG_CXX_VISIBILITY_INLINES_HIDDEN
376
-- Performing Test FLAG_CXX_VISIBILITY_INLINES_HIDDEN - Success
377
-- Performing Test FLAG_C_VISIBILITY_HIDDEN
378
-- Performing Test FLAG_C_VISIBILITY_HIDDEN - Success
379
-- Performing Test FLAG_CXX_VISIBILITY_HIDDEN
380
-- Performing Test FLAG_CXX_VISIBILITY_HIDDEN - Success
381
-- Performing Test FLAG_C_FOMIT_FRAME_POINTER
382
-- Performing Test FLAG_C_FOMIT_FRAME_POINTER - Success
383
-- Performing Test FLAG_CXX_FOMIT_FRAME_POINTER
384
-- Performing Test FLAG_CXX_FOMIT_FRAME_POINTER - Success
385
-- Performing Test FLAG_C_GGDB
386
-- Performing Test FLAG_C_GGDB - Success
387
-- Performing Test FLAG_CXX_GGDB
388
-- Performing Test FLAG_CXX_GGDB - Success
389
-- Looking for pthread.h
390
-- Looking for pthread.h - found
391
-- Looking for pthread_create
392
-- Looking for pthread_create - found
393
-- Found Threads: TRUE  
394
-- Found PkgConfig: /usr/bin/pkg-config (found version "1.6.1") 
395
-- Found OpenGL: /usr/lib/libGL.so   
396
-- Found X11: /usr/include   
397
-- Looking for XOpenDisplay in /usr/lib/libX11.so;/usr/lib/libXext.so
398
-- Looking for XOpenDisplay in /usr/lib/libX11.so;/usr/lib/libXext.so - found
399
-- Looking for gethostbyname
400
-- Looking for gethostbyname - found
401
-- Looking for connect
402
-- Looking for connect - found
403
-- Looking for remove
404
-- Looking for remove - found
405
-- Looking for shmat
406
-- Looking for shmat - found
407
-- Looking for IceConnectionNumber in ICE
408
-- Looking for IceConnectionNumber in ICE - found
409
-- Xrandr not found
410
-- Checking for module 'xi>=1.5.0'
411
--   Found xi, version 1.7.10
412
-- X11 support enabled
413
-- Checking for module 'egl'
414
--   Found egl, version 19.1.1
415
-- Found EGL: /usr/include  
416
-- EGL OpenGL interface enabled
417
--  Found avcodec: /usr/include /usr/lib/libavcodec.so
418
--  Found avdevice: /usr/include /usr/lib/libavdevice.so
419
--  Found avfilter: /usr/include /usr/lib/libavfilter.so
420
--  Found avformat: /usr/include /usr/lib/libavformat.so
421
--  Found avutil: /usr/include /usr/lib/libavutil.so
422
--  Found swresample: /usr/include /usr/lib/libswresample.so
423
--  Found swscale: /usr/include /usr/lib/libswscale.so
424
-- Found FFmpeg: /usr/include  found components:  avcodec avformat avutil swscale 
425
-- libav/ffmpeg found, enabling AVI frame dumps
426
-- Found LIBUDEV: /usr/lib/libudev.so  
427
-- Found libevdev: /usr/lib/libevdev.so  
428
-- libevdev/libudev found, enabling evdev controller backend
429
-- Using named pipes as controller inputs
430
-- Watching game memory for changes
431
-- Enabling analytics collection (subject to end-user opt-in)
432
-- Performing Test FLAG_C_CXX11
433
-- Performing Test FLAG_C_CXX11 - Failed
434
-- Performing Test FLAG_CXX_CXX11
435
-- Performing Test FLAG_CXX_CXX11 - Success
436
-- Version: 5.3.0
437
-- Build type: RelWithDebInfo
438
-- CXX_STANDARD: 11
439
-- Performing Test has_std_11_flag
440
-- Performing Test has_std_11_flag - Success
441
-- Performing Test has_std_0x_flag
442
-- Performing Test has_std_0x_flag - Success
443
-- Performing Test SUPPORTS_VARIADIC_TEMPLATES
444
-- Performing Test SUPPORTS_VARIADIC_TEMPLATES - Success
445
-- Performing Test SUPPORTS_INITIALIZER_LIST
446
-- Performing Test SUPPORTS_INITIALIZER_LIST - Success
447
-- Performing Test SUPPORTS_ENUM_BASE
448
-- Performing Test SUPPORTS_ENUM_BASE - Success
449
-- Performing Test SUPPORTS_TYPE_TRAITS
450
-- Performing Test SUPPORTS_TYPE_TRAITS - Success
451
-- Performing Test SUPPORTS_USER_DEFINED_LITERALS
452
-- Performing Test SUPPORTS_USER_DEFINED_LITERALS - Success
453
-- Looking for open
454
-- Looking for open - found
455
-- Found pugixml: /usr/lib/libpugixml.so  
456
-- Using static enet from Externals
457
-- Looking for fcntl
458
-- Looking for fcntl - found
459
-- Looking for poll
460
-- Looking for poll - found
461
-- Looking for getaddrinfo
462
-- Looking for getaddrinfo - found
463
-- Looking for getnameinfo
464
-- Looking for getnameinfo - found
465
-- Looking for gethostbyname_r
466
-- Looking for gethostbyname_r - found
467
-- Looking for gethostbyaddr_r
468
-- Looking for gethostbyaddr_r - found
469
-- Looking for inet_pton
470
-- Looking for inet_pton - found
471
-- Looking for inet_ntop
472
-- Looking for inet_ntop - found
473
-- Performing Test HAS_MSGHDR_FLAGS
474
-- Performing Test HAS_MSGHDR_FLAGS - Success
475
-- Check size of socklen_t
476
-- Check size of socklen_t - done
477
-- Using static xxhash from Externals
478
-- Found ZLIB: /lib/libz.so (found version "1.2.11") 
479
-- Using shared zlib
480
-- Using shared lzo
481
-- Using shared libpng
482
-- Using static FreeSurround from Externals
483
-- Could NOT find CUBEB (missing: CUBEB_INCLUDE_DIR CUBEB_LIBRARY) 
484
-- Using static cubeb from Externals
485
-- Performing Test COMPILER_HAS_HIDDEN_VISIBILITY
486
-- Performing Test COMPILER_HAS_HIDDEN_VISIBILITY - Success
487
-- Performing Test COMPILER_HAS_HIDDEN_INLINE_VISIBILITY
488
-- Performing Test COMPILER_HAS_HIDDEN_INLINE_VISIBILITY - Success
489
-- Performing Test COMPILER_HAS_DEPRECATED_ATTR
490
-- Performing Test COMPILER_HAS_DEPRECATED_ATTR - Success
491
-- Looking for include file AudioUnit/AudioUnit.h
492
-- Looking for include file AudioUnit/AudioUnit.h - not found
493
-- Looking for include file pulse/pulseaudio.h
494
-- Looking for include file pulse/pulseaudio.h - found
495
-- Looking for include file alsa/asoundlib.h
496
-- Looking for include file alsa/asoundlib.h - found
497
-- Looking for include file jack/jack.h
498
-- Looking for include file jack/jack.h - not found
499
-- Looking for include file audioclient.h
500
-- Looking for include file audioclient.h - not found
501
-- Looking for include files windows.h, mmsystem.h
502
-- Looking for include files windows.h, mmsystem.h - not found
503
-- Looking for include file SLES/OpenSLES.h
504
-- Looking for include file SLES/OpenSLES.h - not found
505
-- Looking for include file android/log.h
506
-- Looking for include file android/log.h - not found
507
-- Looking for include file sndio.h
508
-- Looking for include file sndio.h - not found
509
-- Looking for include file kai.h
510
-- Looking for include file kai.h - not found
511
-- Checking for module 'libusb-1.0'
512
--   Found libusb-1.0, version 1.0.22
513
-- Found libusb-1.0: /usr/include/libusb-1.0, /usr/lib/libusb-1.0.so
514
-- Using shared LibUSB
515
-- Found SFML 2.5 in /usr/include
516
-- Using shared SFML
517
-- Found MINIUPNPC: /usr/include/miniupnpc  
518
-- Using shared miniupnpc
519
-- Performing Test MBEDTLS_VERSION_OK
520
-- Performing Test MBEDTLS_VERSION_OK - Success
521
-- Found MBEDTLS: /usr/include  
522
-- Using shared mbed TLS
523
-- Found CURL: /usr/lib/libcurl.so (found version "7.65.1")  
524
-- Using shared libcurl
525
-- Found HIDAPI: /usr/lib/libhidapi-hidraw.so  
526
-- Could NOT find SYSTEMD (missing: SYSTEMD_LIBRARIES SYSTEMD_INCLUDE_DIRS) 
527
-- libsystemd not found, disabling traversal server watchdog support
528
-- Using static gtest from Externals
529
-- Found PythonInterp: /usr/bin/python3.7 (found version "3.7.3") 
530
-- Could NOT find OpenSLES (missing: OPENSLES_LIBRARY OPENSLES_INCLUDE_DIR) 
531
-- Found ALSA: /usr/lib/libasound.so (found version "1.1.9") 
532
-- ALSA found, enabling ALSA sound backend
533
-- PulseAudio found, enabling PulseAudio sound backend
534
-- Found BlueZ: /usr/lib/libbluetooth.so  
535
-- BlueZ found, enabling bluetooth support
536
-- Found Qt version 5.12.4
537
-- Found Gettext: /usr/bin/msgmerge (found version "0.19.8.1") 
538
-- Configuring done
539
-- Generating done
540
-- Build files have been written to: /home/builder/aports/testing/dolphin-emu/src/dolphin-769ba43abf3afc0f65dfa610236636e80371d3ca/build
541
[0/785] Building CXX object Externals/Bochs_disasm/CMakeFiles/bdisasm.dir/dis_decode.cc.o
[0/785] Building CXX object Externals/Bochs_disasm/CMakeFiles/bdisasm.dir/dis_groups.cc.o
[0/785] Building CXX object Externals/Bochs_disasm/CMakeFiles/bdisasm.dir/resolve.cc.o
[0/785] Building CXX object Externals/Bochs_disasm/CMakeFiles/bdisasm.dir/syntax.cc.o
[0/785] Building CXX object Externals/cpp-optparse/CMakeFiles/cpp-optparse.dir/OptionParser.cpp.o
[0/785] Building CXX object Externals/fmt/CMakeFiles/fmt.dir/src/format.cc.o
[0/785] Building CXX object Externals/fmt/CMakeFiles/fmt.dir/src/posix.cc.o
[0/785] Building CXX object Externals/glslang/CMakeFiles/glslang.dir/glslang/GenericCodeGen/CodeGen.cpp.o
[0/785] Building CXX object Externals/glslang/CMakeFiles/glslang.dir/glslang/GenericCodeGen/Link.cpp.o
[0/785] Building CXX object Externals/glslang/CMakeFiles/glslang.dir/glslang/MachineIndependent/attribute.cpp.o
[0/785] Building CXX object Externals/glslang/CMakeFiles/glslang.dir/glslang/MachineIndependent/Constant.cpp.o
[0/785] Building CXX object Externals/glslang/CMakeFiles/glslang.dir/glslang/MachineIndependent/glslang_tab.cpp.o
[0/785] Building CXX object Externals/glslang/CMakeFiles/glslang.dir/glslang/MachineIndependent/InfoSink.cpp.o
[0/785] Building CXX object Externals/glslang/CMakeFiles/glslang.dir/glslang/MachineIndependent/Initialize.cpp.o
[0/785] Building CXX object Externals/glslang/CMakeFiles/glslang.dir/glslang/MachineIndependent/Intermediate.cpp.o
[0/785] Building CXX object Externals/glslang/CMakeFiles/glslang.dir/glslang/MachineIndependent/intermOut.cpp.o
[0/785] Building CXX object Externals/glslang/CMakeFiles/glslang.dir/glslang/MachineIndependent/IntermTraverse.cpp.o
[0/785] Building CXX object Externals/glslang/CMakeFiles/glslang.dir/glslang/MachineIndependent/iomapper.cpp.o
[1/785] Building CXX object Externals/Bochs_disasm/CMakeFiles/bdisasm.dir/syntax.cc.o
[1/785] Building CXX object Externals/glslang/CMakeFiles/glslang.dir/glslang/MachineIndependent/limits.cpp.o
[2/785] Building CXX object Externals/Bochs_disasm/CMakeFiles/bdisasm.dir/resolve.cc.o
[2/785] Building CXX object Externals/glslang/CMakeFiles/glslang.dir/glslang/MachineIndependent/linkValidate.cpp.o
[3/785] Building CXX object Externals/Bochs_disasm/CMakeFiles/bdisasm.dir/dis_groups.cc.o
[3/785] Building CXX object Externals/glslang/CMakeFiles/glslang.dir/glslang/MachineIndependent/parseConst.cpp.o
[4/785] Building CXX object Externals/Bochs_disasm/CMakeFiles/bdisasm.dir/dis_decode.cc.o
[4/785] Linking CXX static library Externals/Bochs_disasm/libbdisasm.a
[5/785] Linking CXX static library Externals/Bochs_disasm/libbdisasm.a
[5/785] Building CXX object Externals/glslang/CMakeFiles/glslang.dir/glslang/MachineIndependent/ParseContextBase.cpp.o
[6/785] Building CXX object Externals/fmt/CMakeFiles/fmt.dir/src/posix.cc.o
[6/785] Building CXX object Externals/glslang/CMakeFiles/glslang.dir/glslang/MachineIndependent/ParseHelper.cpp.o
[7/785] Building CXX object Externals/glslang/CMakeFiles/glslang.dir/glslang/GenericCodeGen/Link.cpp.o
[7/785] Building CXX object Externals/glslang/CMakeFiles/glslang.dir/glslang/MachineIndependent/PoolAlloc.cpp.o
[8/785] Building CXX object Externals/glslang/CMakeFiles/glslang.dir/glslang/MachineIndependent/InfoSink.cpp.o
[8/785] Building CXX object Externals/glslang/CMakeFiles/glslang.dir/glslang/MachineIndependent/preprocessor/Pp.cpp.o
[9/785] Building CXX object Externals/glslang/CMakeFiles/glslang.dir/glslang/GenericCodeGen/CodeGen.cpp.o
[9/785] Building CXX object Externals/glslang/CMakeFiles/glslang.dir/glslang/MachineIndependent/preprocessor/PpAtom.cpp.o
[10/785] Building CXX object Externals/glslang/CMakeFiles/glslang.dir/glslang/MachineIndependent/IntermTraverse.cpp.o
[10/785] Building CXX object Externals/glslang/CMakeFiles/glslang.dir/glslang/MachineIndependent/preprocessor/PpContext.cpp.o
[11/785] Building CXX object Externals/glslang/CMakeFiles/glslang.dir/glslang/MachineIndependent/PoolAlloc.cpp.o
[11/785] Building CXX object Externals/glslang/CMakeFiles/glslang.dir/glslang/MachineIndependent/preprocessor/PpScanner.cpp.o
[12/785] Building CXX object Externals/glslang/CMakeFiles/glslang.dir/glslang/MachineIndependent/limits.cpp.o
[12/785] Building CXX object Externals/glslang/CMakeFiles/glslang.dir/glslang/MachineIndependent/preprocessor/PpTokens.cpp.o
[13/785] Building CXX object Externals/glslang/CMakeFiles/glslang.dir/glslang/MachineIndependent/attribute.cpp.o
[13/785] Building CXX object Externals/glslang/CMakeFiles/glslang.dir/glslang/MachineIndependent/propagateNoContraction.cpp.o
[14/785] Building CXX object Externals/glslang/CMakeFiles/glslang.dir/glslang/MachineIndependent/parseConst.cpp.o
[14/785] Building CXX object Externals/glslang/CMakeFiles/glslang.dir/glslang/MachineIndependent/reflection.cpp.o
[15/785] Building CXX object Externals/glslang/CMakeFiles/glslang.dir/glslang/MachineIndependent/preprocessor/PpAtom.cpp.o
[15/785] Building CXX object Externals/glslang/CMakeFiles/glslang.dir/glslang/MachineIndependent/RemoveTree.cpp.o
[16/785] Building CXX object Externals/glslang/CMakeFiles/glslang.dir/glslang/MachineIndependent/preprocessor/PpContext.cpp.o
[16/785] Building CXX object Externals/glslang/CMakeFiles/glslang.dir/glslang/MachineIndependent/Scan.cpp.o
[17/785] Building CXX object Externals/glslang/CMakeFiles/glslang.dir/glslang/MachineIndependent/preprocessor/PpTokens.cpp.o
[17/785] Building CXX object Externals/glslang/CMakeFiles/glslang.dir/glslang/MachineIndependent/ShaderLang.cpp.o
[18/785] Building CXX object Externals/glslang/CMakeFiles/glslang.dir/glslang/MachineIndependent/intermOut.cpp.o
[18/785] Building CXX object Externals/glslang/CMakeFiles/glslang.dir/glslang/MachineIndependent/SymbolTable.cpp.o
[19/785] Building CXX object Externals/glslang/CMakeFiles/glslang.dir/glslang/MachineIndependent/Initialize.cpp.o
[19/785] Building CXX object Externals/glslang/CMakeFiles/glslang.dir/glslang/MachineIndependent/Versions.cpp.o
[20/785] Building CXX object Externals/glslang/CMakeFiles/glslang.dir/glslang/MachineIndependent/preprocessor/PpScanner.cpp.o
[20/785] Building CXX object Externals/glslang/CMakeFiles/glslang.dir/OGLCompilersDLL/InitializeDll.cpp.o
[21/785] Building CXX object Externals/glslang/CMakeFiles/glslang.dir/glslang/MachineIndependent/RemoveTree.cpp.o
[21/785] Building CXX object Externals/glslang/CMakeFiles/glslang.dir/SPIRV/disassemble.cpp.o
[22/785] Building CXX object Externals/glslang/CMakeFiles/glslang.dir/glslang/MachineIndependent/ParseContextBase.cpp.o
[22/785] Building CXX object Externals/glslang/CMakeFiles/glslang.dir/SPIRV/doc.cpp.o
[23/785] Building CXX object Externals/cpp-optparse/CMakeFiles/cpp-optparse.dir/OptionParser.cpp.o
[23/785] Linking CXX static library Externals/cpp-optparse/libcpp-optparse.a
[24/785] Linking CXX static library Externals/cpp-optparse/libcpp-optparse.a
[24/785] Building CXX object Externals/glslang/CMakeFiles/glslang.dir/SPIRV/GlslangToSpv.cpp.o
[25/785] Building CXX object Externals/glslang/CMakeFiles/glslang.dir/OGLCompilersDLL/InitializeDll.cpp.o
[25/785] Building CXX object Externals/glslang/CMakeFiles/glslang.dir/SPIRV/InReadableOrder.cpp.o
[26/785] Building CXX object Externals/glslang/CMakeFiles/glslang.dir/glslang/MachineIndependent/propagateNoContraction.cpp.o
[26/785] Building CXX object Externals/glslang/CMakeFiles/glslang.dir/SPIRV/Logger.cpp.o
[27/785] Building CXX object Externals/glslang/CMakeFiles/glslang.dir/glslang/MachineIndependent/preprocessor/Pp.cpp.o
[27/785] Building CXX object Externals/glslang/CMakeFiles/glslang.dir/SPIRV/SpvBuilder.cpp.o
[28/785] Building CXX object Externals/glslang/CMakeFiles/glslang.dir/glslang/MachineIndependent/iomapper.cpp.o
542
In file included from ../Externals/glslang/glslang/MachineIndependent/LiveTraverser.h:39,
543
                 from ../Externals/glslang/glslang/MachineIndependent/iomapper.cpp:39:
544
../Externals/glslang/glslang/MachineIndependent/reflection.h:62:5: warning: type qualifiers ignored on function return type [-Wignored-qualifiers]
545
     const TType* const getType() const { return type; }
546
     ^~~~~
547
[28/785] Building CXX object Externals/glslang/CMakeFiles/glslang.dir/SPIRV/SPVRemapper.cpp.o
[29/785] Building CXX object Externals/glslang/CMakeFiles/glslang.dir/glslang/MachineIndependent/linkValidate.cpp.o
[29/785] Building CXX object Externals/glslang/CMakeFiles/glslang.dir/glslang/OSDependent/Unix/ossource.cpp.o
[30/785] Building CXX object Externals/glslang/CMakeFiles/glslang.dir/glslang/OSDependent/Unix/ossource.cpp.o
[30/785] Building CXX object Externals/imgui/CMakeFiles/imgui.dir/imgui.cpp.o
[31/785] Building CXX object Externals/glslang/CMakeFiles/glslang.dir/SPIRV/Logger.cpp.o
[31/785] Building CXX object Externals/imgui/CMakeFiles/imgui.dir/imgui_draw.cpp.o
[32/785] Building CXX object Externals/glslang/CMakeFiles/glslang.dir/glslang/MachineIndependent/Constant.cpp.o
[32/785] Building CXX object Externals/imgui/CMakeFiles/imgui.dir/imgui_widgets.cpp.o
[33/785] Building CXX object Externals/glslang/CMakeFiles/glslang.dir/SPIRV/disassemble.cpp.o
[33/785] Building C object Externals/enet/CMakeFiles/enet.dir/callbacks.c.o
[34/785] Building C object Externals/enet/CMakeFiles/enet.dir/callbacks.c.o
[34/785] Building C object Externals/enet/CMakeFiles/enet.dir/compress.c.o
[35/785] Building C object Externals/enet/CMakeFiles/enet.dir/compress.c.o
[35/785] Building C object Externals/enet/CMakeFiles/enet.dir/host.c.o
[36/785] Building CXX object Externals/glslang/CMakeFiles/glslang.dir/glslang/MachineIndependent/Intermediate.cpp.o
[36/785] Building C object Externals/enet/CMakeFiles/enet.dir/list.c.o
[37/785] Building C object Externals/enet/CMakeFiles/enet.dir/list.c.o
[37/785] Building C object Externals/enet/CMakeFiles/enet.dir/packet.c.o
[38/785] Building C object Externals/enet/CMakeFiles/enet.dir/packet.c.o
[38/785] Building C object Externals/enet/CMakeFiles/enet.dir/peer.c.o
[39/785] Building C object Externals/enet/CMakeFiles/enet.dir/host.c.o
[39/785] Building C object Externals/enet/CMakeFiles/enet.dir/protocol.c.o
[40/785] Building CXX object Externals/glslang/CMakeFiles/glslang.dir/SPIRV/InReadableOrder.cpp.o
[40/785] Building C object Externals/enet/CMakeFiles/enet.dir/unix.c.o
[41/785] Building C object Externals/enet/CMakeFiles/enet.dir/unix.c.o
548
In file included from ../Externals/enet/unix.c:54:
549
/usr/include/sys/poll.h:1:2: warning: #warning redirecting incorrect #include <sys/poll.h> to <poll.h> [-Wcpp]
550
 #warning redirecting incorrect #include <sys/poll.h> to <poll.h>
551
  ^~~~~~~
552
[41/785] Building C object Externals/enet/CMakeFiles/enet.dir/win32.c.o
[42/785] Building C object Externals/enet/CMakeFiles/enet.dir/win32.c.o
[42/785] Building C object Externals/xxhash/CMakeFiles/xxhash.dir/xxhash.c.o
[43/785] Building C object Externals/enet/CMakeFiles/enet.dir/peer.c.o
[43/785] Building C object Externals/minizip/CMakeFiles/minizip.dir/ioapi.c.o
[44/785] Building CXX object Externals/glslang/CMakeFiles/glslang.dir/glslang/MachineIndependent/Versions.cpp.o
[44/785] Building C object Externals/minizip/CMakeFiles/minizip.dir/unzip.c.o
[45/785] Building C object Externals/minizip/CMakeFiles/minizip.dir/ioapi.c.o
[45/785] Building CXX object Externals/FreeSurround/CMakeFiles/FreeSurround.dir/source/ChannelMaps.cpp.o
[46/785] Building C object Externals/xxhash/CMakeFiles/xxhash.dir/xxhash.c.o
[46/785] Linking C static library Externals/xxhash/libxxhash.a
[47/785] Linking C static library Externals/xxhash/libxxhash.a
[47/785] Building CXX object Externals/FreeSurround/CMakeFiles/FreeSurround.dir/source/KissFFT.cpp.o
[48/785] Building C object Externals/enet/CMakeFiles/enet.dir/protocol.c.o
[48/785] Linking C static library Externals/enet/libenet.a
[49/785] Linking C static library Externals/enet/libenet.a
[49/785] Building CXX object Externals/FreeSurround/CMakeFiles/FreeSurround.dir/source/KissFFTR.cpp.o
[50/785] Building CXX object Externals/glslang/CMakeFiles/glslang.dir/glslang/MachineIndependent/Scan.cpp.o
[50/785] Building CXX object Externals/FreeSurround/CMakeFiles/FreeSurround.dir/source/FreeSurroundDecoder.cpp.o
[51/785] Building CXX object Externals/FreeSurround/CMakeFiles/FreeSurround.dir/source/KissFFT.cpp.o
[51/785] Building CXX object Externals/soundtouch/CMakeFiles/SoundTouch.dir/AAFilter.cpp.o
[52/785] Building CXX object Externals/FreeSurround/CMakeFiles/FreeSurround.dir/source/KissFFTR.cpp.o
[52/785] Building CXX object Externals/soundtouch/CMakeFiles/SoundTouch.dir/BPMDetect.cpp.o
[53/785] Building CXX object Externals/soundtouch/CMakeFiles/SoundTouch.dir/AAFilter.cpp.o
[53/785] Building CXX object Externals/soundtouch/CMakeFiles/SoundTouch.dir/cpu_detect_x86.cpp.o
[54/785] Building C object Externals/minizip/CMakeFiles/minizip.dir/unzip.c.o
[54/785] Linking C static library Externals/minizip/libminizip.a
[55/785] Building CXX object Externals/soundtouch/CMakeFiles/SoundTouch.dir/BPMDetect.cpp.o
[55/785] Building CXX object Externals/soundtouch/CMakeFiles/SoundTouch.dir/FIFOSampleBuffer.cpp.o
[56/785] Linking C static library Externals/minizip/libminizip.a
[56/785] Building CXX object Externals/soundtouch/CMakeFiles/SoundTouch.dir/FIRFilter.cpp.o
[57/785] Building CXX object Externals/soundtouch/CMakeFiles/SoundTouch.dir/cpu_detect_x86.cpp.o
[57/785] Building CXX object Source/Core/Core/CMakeFiles/core.dir/Boot/ElfReader.cpp.o
[58/785] Building CXX object Externals/glslang/CMakeFiles/glslang.dir/SPIRV/doc.cpp.o
[58/785] Building CXX object Externals/soundtouch/CMakeFiles/SoundTouch.dir/InterpolateCubic.cpp.o
[59/785] Building CXX object Externals/soundtouch/CMakeFiles/SoundTouch.dir/FIFOSampleBuffer.cpp.o
[59/785] Building CXX object Externals/soundtouch/CMakeFiles/SoundTouch.dir/InterpolateLinear.cpp.o
[60/785] Building CXX object Externals/glslang/CMakeFiles/glslang.dir/glslang/MachineIndependent/reflection.cpp.o
553
In file included from ../Externals/glslang/glslang/MachineIndependent/reflection.cpp:37:
554
../Externals/glslang/glslang/MachineIndependent/reflection.h:62:5: warning: type qualifiers ignored on function return type [-Wignored-qualifiers]
555
     const TType* const getType() const { return type; }
556
     ^~~~~
557
[60/785] Building CXX object Externals/soundtouch/CMakeFiles/SoundTouch.dir/InterpolateShannon.cpp.o
[61/785] Building CXX object Externals/soundtouch/CMakeFiles/SoundTouch.dir/FIRFilter.cpp.o
[61/785] Building CXX object Externals/soundtouch/CMakeFiles/SoundTouch.dir/mmx_optimized.cpp.o
[62/785] Building CXX object Externals/soundtouch/CMakeFiles/SoundTouch.dir/InterpolateCubic.cpp.o
[62/785] Building CXX object Externals/soundtouch/CMakeFiles/SoundTouch.dir/PeakFinder.cpp.o
[63/785] Building CXX object Externals/soundtouch/CMakeFiles/SoundTouch.dir/mmx_optimized.cpp.o
[63/785] Building CXX object Externals/soundtouch/CMakeFiles/SoundTouch.dir/RateTransposer.cpp.o
[64/785] Building CXX object Externals/soundtouch/CMakeFiles/SoundTouch.dir/InterpolateLinear.cpp.o
[64/785] Building CXX object Externals/soundtouch/CMakeFiles/SoundTouch.dir/SoundTouch.cpp.o
[65/785] Building CXX object Externals/soundtouch/CMakeFiles/SoundTouch.dir/InterpolateShannon.cpp.o
[65/785] Building CXX object Externals/soundtouch/CMakeFiles/SoundTouch.dir/sse_optimized.cpp.o
[66/785] Building CXX object Externals/soundtouch/CMakeFiles/SoundTouch.dir/sse_optimized.cpp.o
[66/785] Building CXX object Externals/soundtouch/CMakeFiles/SoundTouch.dir/TDStretch.cpp.o
[67/785] Building CXX object Externals/soundtouch/CMakeFiles/SoundTouch.dir/PeakFinder.cpp.o
[67/785] Building CXX object Source/Core/Core/CMakeFiles/core.dir/DSP/Interpreter/DSPIntBranch.cpp.o
[68/785] Building CXX object Externals/soundtouch/CMakeFiles/SoundTouch.dir/RateTransposer.cpp.o
[68/785] Building C object Externals/cubeb/CMakeFiles/speex.dir/src/speex/resample.c.o
[69/785] Building CXX object Externals/soundtouch/CMakeFiles/SoundTouch.dir/SoundTouch.cpp.o
[69/785] Building C object Externals/cubeb/CMakeFiles/cubeb.dir/src/cubeb.c.o
[70/785] Building CXX object Externals/soundtouch/CMakeFiles/SoundTouch.dir/TDStretch.cpp.o
[70/785] Linking CXX static library Externals/soundtouch/libSoundTouch.a
[71/785] Linking CXX static library Externals/soundtouch/libSoundTouch.a
[71/785] Building CXX object Externals/cubeb/CMakeFiles/cubeb.dir/src/cubeb_mixer.cpp.o
[72/785] Building C object Externals/cubeb/CMakeFiles/cubeb.dir/src/cubeb.c.o
[72/785] Building CXX object Externals/cubeb/CMakeFiles/cubeb.dir/src/cubeb_resampler.cpp.o
[73/785] Building CXX object Externals/fmt/CMakeFiles/fmt.dir/src/format.cc.o
558
In file included from ../Externals/fmt/src/format.cc:8:
559
../Externals/fmt/include/fmt/format-inl.h:466:15: warning: no previous declaration for 'bool fmt::v5::internal::grisu2_round(char*, int&, int, uint64_t, uint64_t, uint64_t, uint64_t, int&)' [-Wmissing-declarations]
560
 FMT_FUNC bool grisu2_round(
561
               ^~~~~~~~~~~~
562
../Externals/fmt/include/fmt/format-inl.h:484:15: warning: no previous declaration for 'bool fmt::v5::internal::grisu2_gen_digits(char*, int&, uint32_t, uint64_t, int&, uint64_t, const fmt::v5::internal::fp&, const fmt::v5::internal::fp&, int)' [-Wmissing-declarations]
563
 FMT_FUNC bool grisu2_gen_digits(
564
               ^~~~~~~~~~~~~~~~~
565
../Externals/fmt/include/fmt/format-inl.h:673:28: warning: no previous declaration for 'fmt::v5::internal::gen_digits_params fmt::v5::internal::process_specs(const fmt::v5::core_format_specs&, int, fmt::v5::internal::buffer&)' [-Wmissing-declarations]
566
 FMT_FUNC gen_digits_params process_specs(const core_format_specs &specs,
567
                            ^~~~~~~~~~~~~
568
[73/785] Linking CXX static library Externals/fmt/libfmt.a
[74/785] Linking CXX static library Externals/fmt/libfmt.a
[74/785] Building CXX object Externals/cubeb/CMakeFiles/cubeb.dir/src/cubeb_panner.cpp.o
[75/785] Building C object Externals/cubeb/CMakeFiles/speex.dir/src/speex/resample.c.o
569
../Externals/cubeb/src/speex/resample.c: In function 'update_filter':
570
../Externals/cubeb/src/speex/resample.c:674:20: warning: comparison of integer expressions of different signedness: 'int' and 'unsigned int' [-Wsign-compare]
571
          for (j=0;j<st->filt_len;j++)
572
                    ^
573
../Externals/cubeb/src/speex/resample.c: In function 'speex_resampler_process_float':
574
../Externals/cubeb/src/speex/resample.c:946:21: warning: comparison of integer expressions of different signedness: 'int' and 'unsigned int' [-Wsign-compare]
575
            for(j=0;j<ichunk;++j)
576
                     ^
577
../Externals/cubeb/src/speex/resample.c:949:20: warning: comparison of integer expressions of different signedness: 'int' and 'unsigned int' [-Wsign-compare]
578
           for(j=0;j<ichunk;++j)
579
                    ^
580
../Externals/cubeb/src/speex/resample.c: In function 'speex_resampler_process_int':
581
../Externals/cubeb/src/speex/resample.c:1002:19: warning: comparison of integer expressions of different signedness: 'int' and 'unsigned int' [-Wsign-compare]
582
          for(j=0;j<ichunk;++j)
583
                   ^
584
../Externals/cubeb/src/speex/resample.c:1009:19: warning: comparison of integer expressions of different signedness: 'int' and 'unsigned int' [-Wsign-compare]
585
          for(j=0;j<ichunk;++j)
586
                   ^
587
../Externals/cubeb/src/speex/resample.c:1019:16: warning: comparison of integer expressions of different signedness: 'int' and 'unsigned int' [-Wsign-compare]
588
      for (j=0;j<ochunk+omagic;++j)
589
                ^
590
[75/785] Building CXX object Externals/cubeb/CMakeFiles/cubeb.dir/src/cubeb_log.cpp.o
[76/785] Building CXX object Source/Core/Core/CMakeFiles/core.dir/DSP/Interpreter/DSPIntBranch.cpp.o
[76/785] Building C object Externals/cubeb/CMakeFiles/cubeb.dir/src/cubeb_strings.c.o
[77/785] Building CXX object Externals/glslang/CMakeFiles/glslang.dir/glslang/MachineIndependent/SymbolTable.cpp.o
[77/785] Building C object Externals/cubeb/CMakeFiles/cubeb.dir/src/cubeb_pulse.c.o
[78/785] Building CXX object Externals/cubeb/CMakeFiles/cubeb.dir/src/cubeb_panner.cpp.o
[78/785] Building C object Externals/cubeb/CMakeFiles/cubeb.dir/src/cubeb_alsa.c.o
[79/785] Building C object Externals/cubeb/CMakeFiles/cubeb.dir/src/cubeb_strings.c.o
[79/785] Building CXX object Source/Core/AudioCommon/CMakeFiles/audiocommon.dir/AudioCommon.cpp.o
[80/785] Building CXX object Externals/cubeb/CMakeFiles/cubeb.dir/src/cubeb_mixer.cpp.o
[80/785] Building CXX object Source/Core/AudioCommon/CMakeFiles/audiocommon.dir/AudioStretcher.cpp.o
[81/785] Building CXX object Externals/FreeSurround/CMakeFiles/FreeSurround.dir/source/ChannelMaps.cpp.o
[81/785] Building CXX object Source/Core/AudioCommon/CMakeFiles/audiocommon.dir/CubebStream.cpp.o
[82/785] Building C object Externals/cubeb/CMakeFiles/cubeb.dir/src/cubeb_alsa.c.o
591
../Externals/cubeb/src/cubeb_alsa.c:8: warning: "_DEFAULT_SOURCE" redefined
592
 #define _DEFAULT_SOURCE
593
 
594
<command-line>: note: this is the location of the previous definition
595
../Externals/cubeb/src/cubeb_alsa.c:748:1: warning: no previous declaration for 'alsa_init' [-Wmissing-declarations]
596
 alsa_init(cubeb ** context, char const * context_name)
597
 ^~~~~~~~~
598
../Externals/cubeb/src/cubeb_alsa.c: In function 'alsa_stream_stop':
599
../Externals/cubeb/src/cubeb_alsa.c:1211:9: warning: declaration of 'r' shadows a previous local [-Wshadow]
600
     int r = alsa_stream_stop(stm->other_stream);
601
         ^
602
../Externals/cubeb/src/cubeb_alsa.c:1205:7: note: shadowed declaration is here
603
   int r;
604
       ^
605
[82/785] Building CXX object Source/Core/AudioCommon/CMakeFiles/audiocommon.dir/CubebUtils.cpp.o
[83/785] Building CXX object Source/Core/Core/CMakeFiles/core.dir/Boot/ElfReader.cpp.o
[83/785] Building CXX object Source/Core/AudioCommon/CMakeFiles/audiocommon.dir/Mixer.cpp.o
[84/785] Building C object Externals/cubeb/CMakeFiles/cubeb.dir/src/cubeb_pulse.c.o
606
../Externals/cubeb/src/cubeb_pulse.c:599:1: warning: no previous declaration for 'pulse_init' [-Wmissing-declarations]
607
 pulse_init(cubeb ** context, char const * context_name)
608
 ^~~~~~~~~~
609
[84/785] Building CXX object Source/Core/AudioCommon/CMakeFiles/audiocommon.dir/SurroundDecoder.cpp.o
[85/785] Building CXX object Externals/cubeb/CMakeFiles/cubeb.dir/src/cubeb_log.cpp.o
610
In file included from ../Externals/cubeb/src/cubeb_log.cpp:10:
611
../Externals/cubeb/src/cubeb_ringbuffer.h: In constructor 'audio_ring_buffer_base<T>::audio_ring_buffer_base(int, int)':
612
../Externals/cubeb/src/cubeb_ringbuffer.h:368:5: warning: declaration of 'channel_count' shadows a member of 'audio_ring_buffer_base<T>' [-Wshadow]
613
     : channel_count(channel_count)
614
     ^
615
../Externals/cubeb/src/cubeb_ringbuffer.h:475:7: note: shadowed declaration is here
616
   int channel_count;
617
       ^~~~~~~~~~~~~
618
[85/785] Building CXX object Source/Core/AudioCommon/CMakeFiles/audiocommon.dir/NullSoundStream.cpp.o
[86/785] Building CXX object Externals/FreeSurround/CMakeFiles/FreeSurround.dir/source/FreeSurroundDecoder.cpp.o
[86/785] Linking CXX static library Externals/FreeSurround/libFreeSurround.a
[87/785] Linking CXX static library Externals/FreeSurround/libFreeSurround.a
[87/785] Building CXX object Source/Core/AudioCommon/CMakeFiles/audiocommon.dir/WaveFile.cpp.o
[88/785] Building CXX object Source/Core/AudioCommon/CMakeFiles/audiocommon.dir/AudioStretcher.cpp.o
[88/785] Building CXX object Source/Core/AudioCommon/CMakeFiles/audiocommon.dir/AlsaSoundStream.cpp.o
[89/785] Building CXX object Externals/glslang/CMakeFiles/glslang.dir/glslang/MachineIndependent/ShaderLang.cpp.o
619
In file included from ../Externals/glslang/glslang/MachineIndependent/ShaderLang.cpp:66:
620
../Externals/glslang/glslang/MachineIndependent/reflection.h:62:5: warning: type qualifiers ignored on function return type [-Wignored-qualifiers]
621
     const TType* const getType() const { return type; }
622
     ^~~~~
623
[89/785] Building CXX object Source/Core/AudioCommon/CMakeFiles/audiocommon.dir/PulseAudioStream.cpp.o
[90/785] Building CXX object Source/Core/AudioCommon/CMakeFiles/audiocommon.dir/NullSoundStream.cpp.o
[90/785] Building CXX object Source/Core/Common/CMakeFiles/traversal_server.dir/TraversalServer.cpp.o
[91/785] Building CXX object Externals/glslang/CMakeFiles/glslang.dir/SPIRV/SPVRemapper.cpp.o
[91/785] Building CXX object Source/Core/Common/CMakeFiles/common.dir/Analytics.cpp.o
[92/785] Building CXX object Source/Core/AudioCommon/CMakeFiles/audiocommon.dir/CubebStream.cpp.o
[92/785] Building CXX object Source/Core/Common/CMakeFiles/common.dir/CDUtils.cpp.o
[93/785] Building CXX object Source/Core/AudioCommon/CMakeFiles/audiocommon.dir/SurroundDecoder.cpp.o
[93/785] Building CXX object Source/Core/Common/CMakeFiles/common.dir/ColorUtil.cpp.o
[94/785] Building CXX object Source/Core/AudioCommon/CMakeFiles/audiocommon.dir/WaveFile.cpp.o
[94/785] Building CXX object Source/Core/Common/CMakeFiles/common.dir/CommonFuncs.cpp.o
[95/785] Building CXX object Source/Core/Common/CMakeFiles/common.dir/ColorUtil.cpp.o
[95/785] Building CXX object Source/Core/Common/CMakeFiles/common.dir/Config/Config.cpp.o
[96/785] Building CXX object Source/Core/AudioCommon/CMakeFiles/audiocommon.dir/Mixer.cpp.o
[96/785] Building CXX object Source/Core/Common/CMakeFiles/common.dir/Config/ConfigInfo.cpp.o
[97/785] Building CXX object Source/Core/AudioCommon/CMakeFiles/audiocommon.dir/CubebUtils.cpp.o
[97/785] Building CXX object Source/Core/Common/CMakeFiles/common.dir/Config/Layer.cpp.o
[98/785] Building CXX object Externals/cubeb/CMakeFiles/cubeb.dir/src/cubeb_resampler.cpp.o
624
In file included from ../Externals/cubeb/src/cubeb_resampler.cpp:19:
625
../Externals/cubeb/src/cubeb_resampler_internal.h: In constructor 'processor::processor(uint32_t)':
626
../Externals/cubeb/src/cubeb_resampler_internal.h:62:5: warning: declaration of 'channels' shadows a member of 'processor' [-Wshadow]
627
     : channels(channels)
628
     ^
629
../Externals/cubeb/src/cubeb_resampler_internal.h:75:18: note: shadowed declaration is here
630
   const uint32_t channels;
631
                  ^~~~~~~~
632
In file included from ../Externals/cubeb/src/cubeb_resampler.cpp:19:
633
../Externals/cubeb/src/cubeb_resampler_internal.h: In constructor 'cubeb_resampler_speex_one_way<T>::cubeb_resampler_speex_one_way(uint32_t, uint32_t, uint32_t, int)':
634
../Externals/cubeb/src/cubeb_resampler_internal.h:183:3: warning: declaration of 'source_rate' shadows a member of 'cubeb_resampler_speex_one_way<T>' [-Wshadow]
635
   : processor(channels)
636
   ^
637
../Externals/cubeb/src/cubeb_resampler_internal.h:364:18: note: shadowed declaration is here
638
   const uint32_t source_rate;
639
                  ^~~~~~~~~~~
640
../Externals/cubeb/src/cubeb_resampler_internal.h:183:3: warning: declaration of 'channels' shadows a member of 'cubeb_resampler_speex_one_way<T>' [-Wshadow]
641
   : processor(channels)
642
   ^
643
In file included from ../Externals/cubeb/src/cubeb_resampler.cpp:19:
644
../Externals/cubeb/src/cubeb_resampler_internal.h:75:18: note: shadowed declaration is here
645
   const uint32_t channels;
646
                  ^~~~~~~~
647
In file included from ../Externals/cubeb/src/cubeb_resampler.cpp:19:
648
../Externals/cubeb/src/cubeb_resampler_internal.h: In constructor 'delay_line<T>::delay_line(uint32_t, uint32_t, uint32_t)':
649
../Externals/cubeb/src/cubeb_resampler_internal.h:386:5: warning: declaration of 'sample_rate' shadows a member of 'delay_line<T>' [-Wshadow]
650
     : processor(channels)
651
     ^
652
../Externals/cubeb/src/cubeb_resampler_internal.h:499:12: note: shadowed declaration is here
653
   uint32_t sample_rate;
654
            ^~~~~~~~~~~
655
../Externals/cubeb/src/cubeb_resampler_internal.h:386:5: warning: declaration of 'channels' shadows a member of 'delay_line<T>' [-Wshadow]
656
     : processor(channels)
657
     ^
658
In file included from ../Externals/cubeb/src/cubeb_resampler.cpp:19:
659
../Externals/cubeb/src/cubeb_resampler_internal.h:75:18: note: shadowed declaration is here
660
   const uint32_t channels;
661
                  ^~~~~~~~
662
../Externals/cubeb/src/cubeb_resampler.cpp: In constructor 'passthrough_resampler<T>::passthrough_resampler(cubeb_stream*, cubeb_data_callback, void*, uint32_t, uint32_t)':
663
../Externals/cubeb/src/cubeb_resampler.cpp:48:69: warning: declaration of 'sample_rate' shadows a member of 'passthrough_resampler<T>' [-Wshadow]
664
                                                 uint32_t sample_rate)
665
                                                                     ^
666
In file included from ../Externals/cubeb/src/cubeb_resampler.cpp:19:
667
../Externals/cubeb/src/cubeb_resampler_internal.h:112:12: note: shadowed declaration is here
668
   uint32_t sample_rate;
669
            ^~~~~~~~~~~
670
../Externals/cubeb/src/cubeb_resampler.cpp: In constructor 'cubeb_resampler_speex<T, InputProcessing, OutputProcessing>::cubeb_resampler_speex(InputProcessor*, OutputProcessor*, cubeb_stream*, cubeb_data_callback, void*)':
671
../Externals/cubeb/src/cubeb_resampler.cpp:95:37: warning: declaration of 'output_processor' shadows a member of 'cubeb_resampler_speex<T, InputProcessing, OutputProcessing>' [-Wshadow]
672
                           void * ptr)
673
                                     ^
674
In file included from ../Externals/cubeb/src/cubeb_resampler.cpp:19:
675
../Externals/cubeb/src/cubeb_resampler_internal.h:155:37: note: shadowed declaration is here
676
   std::unique_ptr<OutputProcessing> output_processor;
677
                                     ^~~~~~~~~~~~~~~~
678
../Externals/cubeb/src/cubeb_resampler.cpp:95:37: warning: declaration of 'input_processor' shadows a member of 'cubeb_resampler_speex<T, InputProcessing, OutputProcessing>' [-Wshadow]
679
                           void * ptr)
680
                                     ^
681
In file included from ../Externals/cubeb/src/cubeb_resampler.cpp:19:
682
../Externals/cubeb/src/cubeb_resampler_internal.h:154:36: note: shadowed declaration is here
683
   std::unique_ptr<InputProcessing> input_processor;
684
                                    ^~~~~~~~~~~~~~~
685
../Externals/cubeb/src/cubeb_resampler.cpp: In instantiation of 'passthrough_resampler<T>::passthrough_resampler(cubeb_stream*, cubeb_data_callback, void*, uint32_t, uint32_t) [with T = short int; cubeb_stream = cubeb_stream; cubeb_data_callback = long int (*)(cubeb_stream*, void*, const void*, void*, long int); uint32_t = unsigned int]':
686
../Externals/cubeb/src/cubeb_resampler_internal.h:528:12:   required from 'cubeb_resampler* cubeb_resampler_create_internal(cubeb_stream*, cubeb_stream_params*, cubeb_stream_params*, unsigned int, cubeb_data_callback, void*, cubeb_resampler_quality) [with T = short int; cubeb_resampler = cubeb_resampler; cubeb_stream = cubeb_stream; cubeb_data_callback = long int (*)(cubeb_stream*, void*, const void*, void*, long int)]'
687
../Externals/cubeb/src/cubeb_resampler.cpp:293:60:   required from here
688
../Externals/cubeb/src/cubeb_resampler.cpp:44:1: warning: declaration of 'sample_rate' shadows a member of 'passthrough_resampler<short int>' [-Wshadow]
689
 passthrough_resampler<T>::passthrough_resampler(cubeb_stream * s,
690
 ^~~~~~~~~~~~~~~~~~~~~~~~
691
In file included from ../Externals/cubeb/src/cubeb_resampler.cpp:19:
692
../Externals/cubeb/src/cubeb_resampler_internal.h:112:12: note: shadowed declaration is here
693
   uint32_t sample_rate;
694
            ^~~~~~~~~~~
695
In file included from ../Externals/cubeb/src/cubeb_resampler.cpp:19:
696
../Externals/cubeb/src/cubeb_resampler_internal.h: In instantiation of 'cubeb_resampler_speex_one_way<T>::cubeb_resampler_speex_one_way(uint32_t, uint32_t, uint32_t, int) [with T = short int; uint32_t = unsigned int]':
697
../Externals/cubeb/src/cubeb_resampler_internal.h:538:9:   required from 'cubeb_resampler* cubeb_resampler_create_internal(cubeb_stream*, cubeb_stream_params*, cubeb_stream_params*, unsigned int, cubeb_data_callback, void*, cubeb_resampler_quality) [with T = short int; cubeb_resampler = cubeb_resampler; cubeb_stream = cubeb_stream; cubeb_data_callback = long int (*)(cubeb_stream*, void*, const void*, void*, long int)]'
698
../Externals/cubeb/src/cubeb_resampler.cpp:293:60:   required from here
699
../Externals/cubeb/src/cubeb_resampler_internal.h:179:3: warning: declaration of 'source_rate' shadows a member of 'cubeb_resampler_speex_one_way<short int>' [-Wshadow]
700
   cubeb_resampler_speex_one_way(uint32_t channels,
701
   ^~~~~~~~~~~~~~~~~~~~~~~~~~~~~
702
../Externals/cubeb/src/cubeb_resampler_internal.h:364:18: note: shadowed declaration is here
703
   const uint32_t source_rate;
704
                  ^~~~~~~~~~~
705
../Externals/cubeb/src/cubeb_resampler_internal.h:179:3: warning: declaration of 'channels' shadows a member of 'cubeb_resampler_speex_one_way<short int>' [-Wshadow]
706
   cubeb_resampler_speex_one_way(uint32_t channels,
707
   ^~~~~~~~~~~~~~~~~~~~~~~~~~~~~
708
In file included from ../Externals/cubeb/src/cubeb_resampler.cpp:19:
709
../Externals/cubeb/src/cubeb_resampler_internal.h:75:18: note: shadowed declaration is here
710
   const uint32_t channels;
711
                  ^~~~~~~~
712
In file included from ../Externals/cubeb/src/cubeb_resampler.cpp:19:
713
../Externals/cubeb/src/cubeb_resampler_internal.h: In instantiation of 'delay_line<T>::delay_line(uint32_t, uint32_t, uint32_t) [with T = short int; uint32_t = unsigned int]':
714
../Externals/cubeb/src/cubeb_resampler_internal.h:562:24:   required from 'cubeb_resampler* cubeb_resampler_create_internal(cubeb_stream*, cubeb_stream_params*, cubeb_stream_params*, unsigned int, cubeb_data_callback, void*, cubeb_resampler_quality) [with T = short int; cubeb_resampler = cubeb_resampler; cubeb_stream = cubeb_stream; cubeb_data_callback = long int (*)(cubeb_stream*, void*, const void*, void*, long int)]'
715
../Externals/cubeb/src/cubeb_resampler.cpp:293:60:   required from here
716
../Externals/cubeb/src/cubeb_resampler_internal.h:385:3: warning: declaration of 'sample_rate' shadows a member of 'delay_line<short int>' [-Wshadow]
717
   delay_line(uint32_t frames, uint32_t channels, uint32_t sample_rate)
718
   ^~~~~~~~~~
719
../Externals/cubeb/src/cubeb_resampler_internal.h:499:12: note: shadowed declaration is here
720
   uint32_t sample_rate;
721
            ^~~~~~~~~~~
722
../Externals/cubeb/src/cubeb_resampler_internal.h:385:3: warning: declaration of 'channels' shadows a member of 'delay_line<short int>' [-Wshadow]
723
   delay_line(uint32_t frames, uint32_t channels, uint32_t sample_rate)
724
   ^~~~~~~~~~
725
In file included from ../Externals/cubeb/src/cubeb_resampler.cpp:19:
726
../Externals/cubeb/src/cubeb_resampler_internal.h:75:18: note: shadowed declaration is here
727
   const uint32_t channels;
728
                  ^~~~~~~~
729
../Externals/cubeb/src/cubeb_resampler.cpp: In instantiation of 'cubeb_resampler_speex<T, InputProcessing, OutputProcessing>::cubeb_resampler_speex(InputProcessor*, OutputProcessor*, cubeb_stream*, cubeb_data_callback, void*) [with T = short int; InputProcessing = cubeb_resampler_speex_one_way<short int>; OutputProcessing = cubeb_resampler_speex_one_way<short int>; cubeb_stream = cubeb_stream; cubeb_data_callback = long int (*)(cubeb_stream*, void*, const void*, void*, long int)]':
730
../Externals/cubeb/src/cubeb_resampler_internal.h:578:12:   required from 'cubeb_resampler* cubeb_resampler_create_internal(cubeb_stream*, cubeb_stream_params*, cubeb_stream_params*, unsigned int, cubeb_data_callback, void*, cubeb_resampler_quality) [with T = short int; cubeb_resampler = cubeb_resampler; cubeb_stream = cubeb_stream; cubeb_data_callback = long int (*)(cubeb_stream*, void*, const void*, void*, long int)]'
731
../Externals/cubeb/src/cubeb_resampler.cpp:293:60:   required from here
732
../Externals/cubeb/src/cubeb_resampler.cpp:90:1: warning: declaration of 'output_processor' shadows a member of 'cubeb_resampler_speex<short int, cubeb_resampler_speex_one_way<short int>, cubeb_resampler_speex_one_way<short int> >' [-Wshadow]
733
 cubeb_resampler_speex<T, InputProcessor, OutputProcessor>
734
 ^~~~~~~~~~~~~~~~~~~~~~~~~~~~~~~~~~~~~~~~~~~~~~~~~~~~~~~~~
735
In file included from ../Externals/cubeb/src/cubeb_resampler.cpp:19:
736
../Externals/cubeb/src/cubeb_resampler_internal.h:155:37: note: shadowed declaration is here
737
   std::unique_ptr<OutputProcessing> output_processor;
738
                                     ^~~~~~~~~~~~~~~~
739
../Externals/cubeb/src/cubeb_resampler.cpp:90:1: warning: declaration of 'input_processor' shadows a member of 'cubeb_resampler_speex<short int, cubeb_resampler_speex_one_way<short int>, cubeb_resampler_speex_one_way<short int> >' [-Wshadow]
740
 cubeb_resampler_speex<T, InputProcessor, OutputProcessor>
741
 ^~~~~~~~~~~~~~~~~~~~~~~~~~~~~~~~~~~~~~~~~~~~~~~~~~~~~~~~~
742
In file included from ../Externals/cubeb/src/cubeb_resampler.cpp:19:
743
../Externals/cubeb/src/cubeb_resampler_internal.h:154:36: note: shadowed declaration is here
744
   std::unique_ptr<InputProcessing> input_processor;
745
                                    ^~~~~~~~~~~~~~~
746
../Externals/cubeb/src/cubeb_resampler.cpp: In instantiation of 'cubeb_resampler_speex<T, InputProcessing, OutputProcessing>::cubeb_resampler_speex(InputProcessor*, OutputProcessor*, cubeb_stream*, cubeb_data_callback, void*) [with T = short int; InputProcessing = cubeb_resampler_speex_one_way<short int>; OutputProcessing = delay_line<short int>; cubeb_stream = cubeb_stream; cubeb_data_callback = long int (*)(cubeb_stream*, void*, const void*, void*, long int)]':
747
../Externals/cubeb/src/cubeb_resampler_internal.h:585:12:   required from 'cubeb_resampler* cubeb_resampler_create_internal(cubeb_stream*, cubeb_stream_params*, cubeb_stream_params*, unsigned int, cubeb_data_callback, void*, cubeb_resampler_quality) [with T = short int; cubeb_resampler = cubeb_resampler; cubeb_stream = cubeb_stream; cubeb_data_callback = long int (*)(cubeb_stream*, void*, const void*, void*, long int)]'
748
../Externals/cubeb/src/cubeb_resampler.cpp:293:60:   required from here
749
../Externals/cubeb/src/cubeb_resampler.cpp:90:1: warning: declaration of 'output_processor' shadows a member of 'cubeb_resampler_speex<short int, cubeb_resampler_speex_one_way<short int>, delay_line<short int> >' [-Wshadow]
750
 cubeb_resampler_speex<T, InputProcessor, OutputProcessor>
751
 ^~~~~~~~~~~~~~~~~~~~~~~~~~~~~~~~~~~~~~~~~~~~~~~~~~~~~~~~~
752
In file included from ../Externals/cubeb/src/cubeb_resampler.cpp:19:
753
../Externals/cubeb/src/cubeb_resampler_internal.h:155:37: note: shadowed declaration is here
754
   std::unique_ptr<OutputProcessing> output_processor;
755
                                     ^~~~~~~~~~~~~~~~
756
../Externals/cubeb/src/cubeb_resampler.cpp:90:1: warning: declaration of 'input_processor' shadows a member of 'cubeb_resampler_speex<short int, cubeb_resampler_speex_one_way<short int>, delay_line<short int> >' [-Wshadow]
757
 cubeb_resampler_speex<T, InputProcessor, OutputProcessor>
758
 ^~~~~~~~~~~~~~~~~~~~~~~~~~~~~~~~~~~~~~~~~~~~~~~~~~~~~~~~~
759
In file included from ../Externals/cubeb/src/cubeb_resampler.cpp:19:
760
../Externals/cubeb/src/cubeb_resampler_internal.h:154:36: note: shadowed declaration is here
761
   std::unique_ptr<InputProcessing> input_processor;
762
                                    ^~~~~~~~~~~~~~~
763
../Externals/cubeb/src/cubeb_resampler.cpp: In instantiation of 'cubeb_resampler_speex<T, InputProcessing, OutputProcessing>::cubeb_resampler_speex(InputProcessor*, OutputProcessor*, cubeb_stream*, cubeb_data_callback, void*) [with T = short int; InputProcessing = delay_line<short int>; OutputProcessing = cubeb_resampler_speex_one_way<short int>; cubeb_stream = cubeb_stream; cubeb_data_callback = long int (*)(cubeb_stream*, void*, const void*, void*, long int)]':
764
../Externals/cubeb/src/cubeb_resampler_internal.h:592:12:   required from 'cubeb_resampler* cubeb_resampler_create_internal(cubeb_stream*, cubeb_stream_params*, cubeb_stream_params*, unsigned int, cubeb_data_callback, void*, cubeb_resampler_quality) [with T = short int; cubeb_resampler = cubeb_resampler; cubeb_stream = cubeb_stream; cubeb_data_callback = long int (*)(cubeb_stream*, void*, const void*, void*, long int)]'
765
../Externals/cubeb/src/cubeb_resampler.cpp:293:60:   required from here
766
../Externals/cubeb/src/cubeb_resampler.cpp:90:1: warning: declaration of 'output_processor' shadows a member of 'cubeb_resampler_speex<short int, delay_line<short int>, cubeb_resampler_speex_one_way<short int> >' [-Wshadow]
767
 cubeb_resampler_speex<T, InputProcessor, OutputProcessor>
768
 ^~~~~~~~~~~~~~~~~~~~~~~~~~~~~~~~~~~~~~~~~~~~~~~~~~~~~~~~~
769
In file included from ../Externals/cubeb/src/cubeb_resampler.cpp:19:
770
../Externals/cubeb/src/cubeb_resampler_internal.h:155:37: note: shadowed declaration is here
771
   std::unique_ptr<OutputProcessing> output_processor;
772
                                     ^~~~~~~~~~~~~~~~
773
../Externals/cubeb/src/cubeb_resampler.cpp:90:1: warning: declaration of 'input_processor' shadows a member of 'cubeb_resampler_speex<short int, delay_line<short int>, cubeb_resampler_speex_one_way<short int> >' [-Wshadow]
774
 cubeb_resampler_speex<T, InputProcessor, OutputProcessor>
775
 ^~~~~~~~~~~~~~~~~~~~~~~~~~~~~~~~~~~~~~~~~~~~~~~~~~~~~~~~~
776
In file included from ../Externals/cubeb/src/cubeb_resampler.cpp:19:
777
../Externals/cubeb/src/cubeb_resampler_internal.h:154:36: note: shadowed declaration is here
778
   std::unique_ptr<InputProcessing> input_processor;
779
                                    ^~~~~~~~~~~~~~~
780
../Externals/cubeb/src/cubeb_resampler.cpp: In instantiation of 'passthrough_resampler<T>::passthrough_resampler(cubeb_stream*, cubeb_data_callback, void*, uint32_t, uint32_t) [with T = float; cubeb_stream = cubeb_stream; cubeb_data_callback = long int (*)(cubeb_stream*, void*, const void*, void*, long int); uint32_t = unsigned int]':
781
../Externals/cubeb/src/cubeb_resampler_internal.h:528:12:   required from 'cubeb_resampler* cubeb_resampler_create_internal(cubeb_stream*, cubeb_stream_params*, cubeb_stream_params*, unsigned int, cubeb_data_callback, void*, cubeb_resampler_quality) [with T = float; cubeb_resampler = cubeb_resampler; cubeb_stream = cubeb_stream; cubeb_data_callback = long int (*)(cubeb_stream*, void*, const void*, void*, long int)]'
782
../Externals/cubeb/src/cubeb_resampler.cpp:301:60:   required from here
783
../Externals/cubeb/src/cubeb_resampler.cpp:44:1: warning: declaration of 'sample_rate' shadows a member of 'passthrough_resampler<float>' [-Wshadow]
784
 passthrough_resampler<T>::passthrough_resampler(cubeb_stream * s,
785
 ^~~~~~~~~~~~~~~~~~~~~~~~
786
In file included from ../Externals/cubeb/src/cubeb_resampler.cpp:19:
787
../Externals/cubeb/src/cubeb_resampler_internal.h:112:12: note: shadowed declaration is here
788
   uint32_t sample_rate;
789
            ^~~~~~~~~~~
790
In file included from ../Externals/cubeb/src/cubeb_resampler.cpp:19:
791
../Externals/cubeb/src/cubeb_resampler_internal.h: In instantiation of 'cubeb_resampler_speex_one_way<T>::cubeb_resampler_speex_one_way(uint32_t, uint32_t, uint32_t, int) [with T = float; uint32_t = unsigned int]':
792
../Externals/cubeb/src/cubeb_resampler_internal.h:538:9:   required from 'cubeb_resampler* cubeb_resampler_create_internal(cubeb_stream*, cubeb_stream_params*, cubeb_stream_params*, unsigned int, cubeb_data_callback, void*, cubeb_resampler_quality) [with T = float; cubeb_resampler = cubeb_resampler; cubeb_stream = cubeb_stream; cubeb_data_callback = long int (*)(cubeb_stream*, void*, const void*, void*, long int)]'
793
../Externals/cubeb/src/cubeb_resampler.cpp:301:60:   required from here
794
../Externals/cubeb/src/cubeb_resampler_internal.h:179:3: warning: declaration of 'source_rate' shadows a member of 'cubeb_resampler_speex_one_way<float>' [-Wshadow]
795
   cubeb_resampler_speex_one_way(uint32_t channels,
796
   ^~~~~~~~~~~~~~~~~~~~~~~~~~~~~
797
../Externals/cubeb/src/cubeb_resampler_internal.h:364:18: note: shadowed declaration is here
798
   const uint32_t source_rate;
799
                  ^~~~~~~~~~~
800
../Externals/cubeb/src/cubeb_resampler_internal.h:179:3: warning: declaration of 'channels' shadows a member of 'cubeb_resampler_speex_one_way<float>' [-Wshadow]
801
   cubeb_resampler_speex_one_way(uint32_t channels,
802
   ^~~~~~~~~~~~~~~~~~~~~~~~~~~~~
803
In file included from ../Externals/cubeb/src/cubeb_resampler.cpp:19:
804
../Externals/cubeb/src/cubeb_resampler_internal.h:75:18: note: shadowed declaration is here
805
   const uint32_t channels;
806
                  ^~~~~~~~
807
In file included from ../Externals/cubeb/src/cubeb_resampler.cpp:19:
808
../Externals/cubeb/src/cubeb_resampler_internal.h: In instantiation of 'delay_line<T>::delay_line(uint32_t, uint32_t, uint32_t) [with T = float; uint32_t = unsigned int]':
809
../Externals/cubeb/src/cubeb_resampler_internal.h:562:24:   required from 'cubeb_resampler* cubeb_resampler_create_internal(cubeb_stream*, cubeb_stream_params*, cubeb_stream_params*, unsigned int, cubeb_data_callback, void*, cubeb_resampler_quality) [with T = float; cubeb_resampler = cubeb_resampler; cubeb_stream = cubeb_stream; cubeb_data_callback = long int (*)(cubeb_stream*, void*, const void*, void*, long int)]'
810
../Externals/cubeb/src/cubeb_resampler.cpp:301:60:   required from here
811
../Externals/cubeb/src/cubeb_resampler_internal.h:385:3: warning: declaration of 'sample_rate' shadows a member of 'delay_line<float>' [-Wshadow]
812
   delay_line(uint32_t frames, uint32_t channels, uint32_t sample_rate)
813
   ^~~~~~~~~~
814
../Externals/cubeb/src/cubeb_resampler_internal.h:499:12: note: shadowed declaration is here
815
   uint32_t sample_rate;
816
            ^~~~~~~~~~~
817
../Externals/cubeb/src/cubeb_resampler_internal.h:385:3: warning: declaration of 'channels' shadows a member of 'delay_line<float>' [-Wshadow]
818
   delay_line(uint32_t frames, uint32_t channels, uint32_t sample_rate)
819
   ^~~~~~~~~~
820
In file included from ../Externals/cubeb/src/cubeb_resampler.cpp:19:
821
../Externals/cubeb/src/cubeb_resampler_internal.h:75:18: note: shadowed declaration is here
822
   const uint32_t channels;
823
                  ^~~~~~~~
824
../Externals/cubeb/src/cubeb_resampler.cpp: In instantiation of 'cubeb_resampler_speex<T, InputProcessing, OutputProcessing>::cubeb_resampler_speex(InputProcessor*, OutputProcessor*, cubeb_stream*, cubeb_data_callback, void*) [with T = float; InputProcessing = cubeb_resampler_speex_one_way<float>; OutputProcessing = cubeb_resampler_speex_one_way<float>; cubeb_stream = cubeb_stream; cubeb_data_callback = long int (*)(cubeb_stream*, void*, const void*, void*, long int)]':
825
../Externals/cubeb/src/cubeb_resampler_internal.h:578:12:   required from 'cubeb_resampler* cubeb_resampler_create_internal(cubeb_stream*, cubeb_stream_params*, cubeb_stream_params*, unsigned int, cubeb_data_callback, void*, cubeb_resampler_quality) [with T = float; cubeb_resampler = cubeb_resampler; cubeb_stream = cubeb_stream; cubeb_data_callback = long int (*)(cubeb_stream*, void*, const void*, void*, long int)]'
826
../Externals/cubeb/src/cubeb_resampler.cpp:301:60:   required from here
827
../Externals/cubeb/src/cubeb_resampler.cpp:90:1: warning: declaration of 'output_processor' shadows a member of 'cubeb_resampler_speex<float, cubeb_resampler_speex_one_way<float>, cubeb_resampler_speex_one_way<float> >' [-Wshadow]
828
 cubeb_resampler_speex<T, InputProcessor, OutputProcessor>
829
 ^~~~~~~~~~~~~~~~~~~~~~~~~~~~~~~~~~~~~~~~~~~~~~~~~~~~~~~~~
830
In file included from ../Externals/cubeb/src/cubeb_resampler.cpp:19:
831
../Externals/cubeb/src/cubeb_resampler_internal.h:155:37: note: shadowed declaration is here
832
   std::unique_ptr<OutputProcessing> output_processor;
833
                                     ^~~~~~~~~~~~~~~~
834
../Externals/cubeb/src/cubeb_resampler.cpp:90:1: warning: declaration of 'input_processor' shadows a member of 'cubeb_resampler_speex<float, cubeb_resampler_speex_one_way<float>, cubeb_resampler_speex_one_way<float> >' [-Wshadow]
835
 cubeb_resampler_speex<T, InputProcessor, OutputProcessor>
836
 ^~~~~~~~~~~~~~~~~~~~~~~~~~~~~~~~~~~~~~~~~~~~~~~~~~~~~~~~~
837
In file included from ../Externals/cubeb/src/cubeb_resampler.cpp:19:
838
../Externals/cubeb/src/cubeb_resampler_internal.h:154:36: note: shadowed declaration is here
839
   std::unique_ptr<InputProcessing> input_processor;
840
                                    ^~~~~~~~~~~~~~~
841
../Externals/cubeb/src/cubeb_resampler.cpp: In instantiation of 'cubeb_resampler_speex<T, InputProcessing, OutputProcessing>::cubeb_resampler_speex(InputProcessor*, OutputProcessor*, cubeb_stream*, cubeb_data_callback, void*) [with T = float; InputProcessing = cubeb_resampler_speex_one_way<float>; OutputProcessing = delay_line<float>; cubeb_stream = cubeb_stream; cubeb_data_callback = long int (*)(cubeb_stream*, void*, const void*, void*, long int)]':
842
../Externals/cubeb/src/cubeb_resampler_internal.h:585:12:   required from 'cubeb_resampler* cubeb_resampler_create_internal(cubeb_stream*, cubeb_stream_params*, cubeb_stream_params*, unsigned int, cubeb_data_callback, void*, cubeb_resampler_quality) [with T = float; cubeb_resampler = cubeb_resampler; cubeb_stream = cubeb_stream; cubeb_data_callback = long int (*)(cubeb_stream*, void*, const void*, void*, long int)]'
843
../Externals/cubeb/src/cubeb_resampler.cpp:301:60:   required from here
844
../Externals/cubeb/src/cubeb_resampler.cpp:90:1: warning: declaration of 'output_processor' shadows a member of 'cubeb_resampler_speex<float, cubeb_resampler_speex_one_way<float>, delay_line<float> >' [-Wshadow]
845
 cubeb_resampler_speex<T, InputProcessor, OutputProcessor>
846
 ^~~~~~~~~~~~~~~~~~~~~~~~~~~~~~~~~~~~~~~~~~~~~~~~~~~~~~~~~
847
In file included from ../Externals/cubeb/src/cubeb_resampler.cpp:19:
848
../Externals/cubeb/src/cubeb_resampler_internal.h:155:37: note: shadowed declaration is here
849
   std::unique_ptr<OutputProcessing> output_processor;
850
                                     ^~~~~~~~~~~~~~~~
851
../Externals/cubeb/src/cubeb_resampler.cpp:90:1: warning: declaration of 'input_processor' shadows a member of 'cubeb_resampler_speex<float, cubeb_resampler_speex_one_way<float>, delay_line<float> >' [-Wshadow]
852
 cubeb_resampler_speex<T, InputProcessor, OutputProcessor>
853
 ^~~~~~~~~~~~~~~~~~~~~~~~~~~~~~~~~~~~~~~~~~~~~~~~~~~~~~~~~
854
In file included from ../Externals/cubeb/src/cubeb_resampler.cpp:19:
855
../Externals/cubeb/src/cubeb_resampler_internal.h:154:36: note: shadowed declaration is here
856
   std::unique_ptr<InputProcessing> input_processor;
857
                                    ^~~~~~~~~~~~~~~
858
../Externals/cubeb/src/cubeb_resampler.cpp: In instantiation of 'cubeb_resampler_speex<T, InputProcessing, OutputProcessing>::cubeb_resampler_speex(InputProcessor*, OutputProcessor*, cubeb_stream*, cubeb_data_callback, void*) [with T = float; InputProcessing = delay_line<float>; OutputProcessing = cubeb_resampler_speex_one_way<float>; cubeb_stream = cubeb_stream; cubeb_data_callback = long int (*)(cubeb_stream*, void*, const void*, void*, long int)]':
859
../Externals/cubeb/src/cubeb_resampler_internal.h:592:12:   required from 'cubeb_resampler* cubeb_resampler_create_internal(cubeb_stream*, cubeb_stream_params*, cubeb_stream_params*, unsigned int, cubeb_data_callback, void*, cubeb_resampler_quality) [with T = float; cubeb_resampler = cubeb_resampler; cubeb_stream = cubeb_stream; cubeb_data_callback = long int (*)(cubeb_stream*, void*, const void*, void*, long int)]'
860
../Externals/cubeb/src/cubeb_resampler.cpp:301:60:   required from here
861
../Externals/cubeb/src/cubeb_resampler.cpp:90:1: warning: declaration of 'output_processor' shadows a member of 'cubeb_resampler_speex<float, delay_line<float>, cubeb_resampler_speex_one_way<float> >' [-Wshadow]
862
 cubeb_resampler_speex<T, InputProcessor, OutputProcessor>
863
 ^~~~~~~~~~~~~~~~~~~~~~~~~~~~~~~~~~~~~~~~~~~~~~~~~~~~~~~~~
864
In file included from ../Externals/cubeb/src/cubeb_resampler.cpp:19:
865
../Externals/cubeb/src/cubeb_resampler_internal.h:155:37: note: shadowed declaration is here
866
   std::unique_ptr<OutputProcessing> output_processor;
867
                                     ^~~~~~~~~~~~~~~~
868
../Externals/cubeb/src/cubeb_resampler.cpp:90:1: warning: declaration of 'input_processor' shadows a member of 'cubeb_resampler_speex<float, delay_line<float>, cubeb_resampler_speex_one_way<float> >' [-Wshadow]
869
 cubeb_resampler_speex<T, InputProcessor, OutputProcessor>
870
 ^~~~~~~~~~~~~~~~~~~~~~~~~~~~~~~~~~~~~~~~~~~~~~~~~~~~~~~~~
871
In file included from ../Externals/cubeb/src/cubeb_resampler.cpp:19:
872
../Externals/cubeb/src/cubeb_resampler_internal.h:154:36: note: shadowed declaration is here
873
   std::unique_ptr<InputProcessing> input_processor;
874
                                    ^~~~~~~~~~~~~~~
875
[98/785] Linking CXX static library Externals/cubeb/libcubeb.a
[99/785] Building CXX object Source/Core/AudioCommon/CMakeFiles/audiocommon.dir/AlsaSoundStream.cpp.o
[99/785] Building CXX object Source/Core/Common/CMakeFiles/common.dir/Crypto/AES.cpp.o
[100/785] Linking CXX static library Externals/cubeb/libcubeb.a
[100/785] Building CXX object Source/Core/Common/CMakeFiles/common.dir/Crypto/bn.cpp.o
[101/785] Building CXX object Source/Core/AudioCommon/CMakeFiles/audiocommon.dir/AudioCommon.cpp.o
[101/785] Building CXX object Source/Core/Common/CMakeFiles/common.dir/Crypto/ec.cpp.o
[102/785] Building CXX object Source/Core/Common/CMakeFiles/common.dir/CommonFuncs.cpp.o
[102/785] Building CXX object Source/Core/Common/CMakeFiles/common.dir/Debug/MemoryPatches.cpp.o
[103/785] Building CXX object Source/Core/AudioCommon/CMakeFiles/audiocommon.dir/PulseAudioStream.cpp.o
[103/785] Linking CXX static library Source/Core/AudioCommon/libaudiocommon.a
[104/785] Linking CXX static library Source/Core/AudioCommon/libaudiocommon.a
[104/785] Building CXX object Source/Core/Common/CMakeFiles/common.dir/Debug/Watches.cpp.o
[105/785] Building CXX object Source/Core/Common/CMakeFiles/common.dir/Crypto/AES.cpp.o
[105/785] Building CXX object Source/Core/Common/CMakeFiles/common.dir/DynamicLibrary.cpp.o
[106/785] Building CXX object Source/Core/Common/CMakeFiles/common.dir/Config/ConfigInfo.cpp.o
[106/785] Building CXX object Source/Core/Common/CMakeFiles/common.dir/ENetUtil.cpp.o
[107/785] Building CXX object Source/Core/Common/CMakeFiles/common.dir/Crypto/bn.cpp.o
[107/785] Building CXX object Source/Core/Common/CMakeFiles/common.dir/File.cpp.o
[108/785] Building CXX object Source/Core/Common/CMakeFiles/common.dir/ENetUtil.cpp.o
[108/785] Building CXX object Source/Core/Common/CMakeFiles/common.dir/FileSearch.cpp.o
[109/785] Building CXX object Externals/imgui/CMakeFiles/imgui.dir/imgui_draw.cpp.o
[109/785] Building CXX object Source/Core/Common/CMakeFiles/common.dir/FileUtil.cpp.o
[110/785] Building CXX object Externals/glslang/CMakeFiles/glslang.dir/SPIRV/SpvBuilder.cpp.o
876
In file included from ../Externals/glslang/SPIRV/hex_float.h:39,
877
                 from ../Externals/glslang/SPIRV/SpvBuilder.cpp:49:
878
../Externals/glslang/SPIRV/bitutils.h: In instantiation of 'Dest spvutils::BitwiseCast(Src) [with Dest = spvutils::Float16; Src = short unsigned int]':
879
../Externals/glslang/SPIRV/hex_float.h:138:47:   required from 'T spvutils::FloatProxy<T>::getAsFloat() const [with T = spvutils::Float16]'
880
../Externals/glslang/SPIRV/hex_float.h:821:52:   required from here
881
../Externals/glslang/SPIRV/bitutils.h:29:14: warning: 'void* memcpy(void*, const void*, size_t)' writing to an object of non-trivially copyable type 'class spvutils::Float16'; use copy-assignment or copy-initialization instead [-Wclass-memaccess]
882
   std::memcpy(&dest, &source, sizeof(dest));
883
   ~~~~~~~~~~~^~~~~~~~~~~~~~~~~~~~~~~~~~~~~~
884
In file included from ../Externals/glslang/SPIRV/SpvBuilder.cpp:49:
885
../Externals/glslang/SPIRV/hex_float.h:43:7: note: 'class spvutils::Float16' declared here
886
 class Float16 {
887
       ^~~~~~~
888
In file included from ../Externals/glslang/SPIRV/hex_float.h:39,
889
                 from ../Externals/glslang/SPIRV/SpvBuilder.cpp:49:
890
../Externals/glslang/SPIRV/bitutils.h: In instantiation of 'Dest spvutils::BitwiseCast(Src) [with Dest = spvutils::FloatProxy<spvutils::Float16>; Src = short unsigned int]':
891
../Externals/glslang/SPIRV/hex_float.h:431:28:   required from 'void spvutils::HexFloat<T, Traits>::setFromSignUnbiasedExponentAndNormalizedSignificand(bool, spvutils::HexFloat<T, Traits>::int_type, spvutils::HexFloat<T, Traits>::uint_type, bool) [with T = spvutils::FloatProxy<spvutils::Float16>; Traits = spvutils::HexFloatTraits<spvutils::FloatProxy<spvutils::Float16> >; spvutils::HexFloat<T, Traits>::int_type = short int; spvutils::HexFloat<T, Traits>::uint_type = short unsigned int]'
892
../Externals/glslang/SPIRV/hex_float.h:633:5:   required from 'void spvutils::HexFloat<T, Traits>::castTo(other_T&, spvutils::round_direction) [with other_T = spvutils::HexFloat<spvutils::FloatProxy<spvutils::Float16>, spvutils::HexFloatTraits<spvutils::FloatProxy<spvutils::Float16> > >; T = spvutils::FloatProxy<float>; Traits = spvutils::HexFloatTraits<spvutils::FloatProxy<float> >]'
893
../Externals/glslang/SPIRV/hex_float.h:817:39:   required from here
894
../Externals/glslang/SPIRV/bitutils.h:29:14: warning: 'void* memcpy(void*, const void*, size_t)' copying an object of non-trivial type 'class spvutils::FloatProxy<spvutils::Float16>' from an array of 'short unsigned int' [-Wclass-memaccess]
895
   std::memcpy(&dest, &source, sizeof(dest));
896
   ~~~~~~~~~~~^~~~~~~~~~~~~~~~~~~~~~~~~~~~~~
897
In file included from ../Externals/glslang/SPIRV/SpvBuilder.cpp:49:
898
../Externals/glslang/SPIRV/hex_float.h:115:7: note: 'class spvutils::FloatProxy<spvutils::Float16>' declared here
899
 class FloatProxy {
900
       ^~~~~~~~~~
901
[110/785] Building CXX object Source/Core/Common/CMakeFiles/common.dir/FloatUtils.cpp.o
[111/785] Building CXX object Source/Core/Common/CMakeFiles/traversal_server.dir/TraversalServer.cpp.o
[111/785] Building CXX object Source/Core/Common/CMakeFiles/common.dir/GekkoDisassembler.cpp.o
[112/785] Building CXX object Source/Core/Common/CMakeFiles/common.dir/Config/Layer.cpp.o
[112/785] Building CXX object Source/Core/Common/CMakeFiles/common.dir/Hash.cpp.o
[113/785] Building CXX object Source/Core/Common/CMakeFiles/common.dir/File.cpp.o
[113/785] Building CXX object Source/Core/Common/CMakeFiles/common.dir/HttpRequest.cpp.o
[114/785] Building CXX object Source/Core/Common/CMakeFiles/common.dir/FloatUtils.cpp.o
[114/785] Building CXX object Source/Core/Common/CMakeFiles/common.dir/Image.cpp.o
[115/785] Building CXX object Source/Core/Common/CMakeFiles/common.dir/Analytics.cpp.o
[115/785] Building CXX object Source/Core/Common/CMakeFiles/common.dir/IniFile.cpp.o
[116/785] Building CXX object Source/Core/Common/CMakeFiles/common.dir/Debug/MemoryPatches.cpp.o
[116/785] Building CXX object Source/Core/Common/CMakeFiles/common.dir/JitRegister.cpp.o
[117/785] Building CXX object Source/Core/Common/CMakeFiles/common.dir/Crypto/ec.cpp.o
[117/785] Building CXX object Source/Core/Common/CMakeFiles/common.dir/Logging/LogManager.cpp.o
[118/785] Building CXX object Source/Core/Common/CMakeFiles/common.dir/Image.cpp.o
[118/785] Building CXX object Source/Core/Common/CMakeFiles/common.dir/MathUtil.cpp.o
[119/785] Building CXX object Source/Core/Common/CMakeFiles/common.dir/Debug/Watches.cpp.o
[119/785] Building CXX object Source/Core/Common/CMakeFiles/common.dir/Matrix.cpp.o
[120/785] Building CXX object Source/Core/Common/CMakeFiles/common.dir/Config/Config.cpp.o
[120/785] Building CXX object Source/Core/Common/CMakeFiles/common.dir/MD5.cpp.o
[121/785] Building CXX object Source/Core/Common/CMakeFiles/common.dir/MathUtil.cpp.o
[121/785] Building CXX object Source/Core/Common/CMakeFiles/common.dir/MemArena.cpp.o
[122/785] Building CXX object Source/Core/Common/CMakeFiles/common.dir/FileSearch.cpp.o
[122/785] Building CXX object Source/Core/Common/CMakeFiles/common.dir/MemoryUtil.cpp.o
[123/785] Building CXX object Source/Core/Common/CMakeFiles/common.dir/Hash.cpp.o
[123/785] Building CXX object Source/Core/Common/CMakeFiles/common.dir/MsgHandler.cpp.o
[124/785] Building CXX object Externals/imgui/CMakeFiles/imgui.dir/imgui_widgets.cpp.o
[124/785] Building CXX object Source/Core/Common/CMakeFiles/common.dir/NandPaths.cpp.o
[125/785] Building CXX object Source/Core/Common/CMakeFiles/common.dir/MemArena.cpp.o
[125/785] Building CXX object Source/Core/Common/CMakeFiles/common.dir/Network.cpp.o
[126/785] Building CXX object Source/Core/Common/CMakeFiles/common.dir/MemoryUtil.cpp.o
[126/785] Building CXX object Source/Core/Common/CMakeFiles/common.dir/PcapFile.cpp.o
[127/785] Building CXX object Source/Core/Common/CMakeFiles/common.dir/Matrix.cpp.o
[127/785] Building CXX object Source/Core/Common/CMakeFiles/common.dir/PerformanceCounter.cpp.o
[128/785] Building CXX object Externals/imgui/CMakeFiles/imgui.dir/imgui.cpp.o
[128/785] Linking CXX static library Externals/imgui/libimgui.a
[129/785] Linking CXX static library Externals/imgui/libimgui.a
[129/785] Building CXX object Source/Core/Common/CMakeFiles/common.dir/Profiler.cpp.o
[130/785] Building CXX object Source/Core/Common/CMakeFiles/common.dir/PerformanceCounter.cpp.o
[130/785] Building CXX object Source/Core/Common/CMakeFiles/common.dir/QoSSession.cpp.o
[131/785] Building CXX object Source/Core/Common/CMakeFiles/common.dir/HttpRequest.cpp.o
[131/785] Building CXX object Source/Core/Common/CMakeFiles/common.dir/Random.cpp.o
[132/785] Building CXX object Externals/glslang/CMakeFiles/glslang.dir/glslang/MachineIndependent/glslang_tab.cpp.o
[132/785] Building CXX object Source/Core/Common/CMakeFiles/common.dir/SDCardUtil.cpp.o
[133/785] Building CXX object Source/Core/Common/CMakeFiles/common.dir/Random.cpp.o
[133/785] Building CXX object Source/Core/Common/CMakeFiles/common.dir/SFMLHelper.cpp.o
[134/785] Building CXX object Source/Core/Common/CMakeFiles/common.dir/QoSSession.cpp.o
[134/785] Building CXX object Source/Core/Common/CMakeFiles/common.dir/SettingsHandler.cpp.o
[135/785] Building CXX object Source/Core/Common/CMakeFiles/common.dir/MsgHandler.cpp.o
[135/785] Building CXX object Source/Core/Common/CMakeFiles/common.dir/StringUtil.cpp.o
[136/785] Building CXX object Source/Core/Common/CMakeFiles/common.dir/PcapFile.cpp.o
[136/785] Building CXX object Source/Core/Common/CMakeFiles/common.dir/SymbolDB.cpp.o
[137/785] Building CXX object Source/Core/Common/CMakeFiles/common.dir/SFMLHelper.cpp.o
[137/785] Building CXX object Source/Core/Common/CMakeFiles/common.dir/Thread.cpp.o
[138/785] Building CXX object Source/Core/Common/CMakeFiles/common.dir/IniFile.cpp.o
[138/785] Building CXX object Source/Core/Common/CMakeFiles/common.dir/Timer.cpp.o
[139/785] Building CXX object Source/Core/Common/CMakeFiles/common.dir/SDCardUtil.cpp.o
[139/785] Building CXX object Source/Core/Common/CMakeFiles/common.dir/TraversalClient.cpp.o
[140/785] Building CXX object Source/Core/Common/CMakeFiles/common.dir/FileUtil.cpp.o
[140/785] Building CXX object Source/Core/Common/CMakeFiles/common.dir/UPnP.cpp.o
[141/785] Building CXX object Externals/glslang/CMakeFiles/glslang.dir/glslang/MachineIndependent/ParseHelper.cpp.o
[141/785] Building CXX object Source/Core/Common/CMakeFiles/common.dir/Version.cpp.o
[142/785] Building CXX object Source/Core/Common/CMakeFiles/common.dir/Profiler.cpp.o
[142/785] Building CXX object Source/Core/Common/CMakeFiles/common.dir/Logging/ConsoleListenerNix.cpp.o
[143/785] Building CXX object Source/Core/Common/CMakeFiles/common.dir/Version.cpp.o
[143/785] Building CXX object Source/Core/Common/CMakeFiles/common.dir/x64ABI.cpp.o
[144/785] Building CXX object Source/Core/Common/CMakeFiles/common.dir/Thread.cpp.o
[144/785] Building CXX object Source/Core/Common/CMakeFiles/common.dir/x64Emitter.cpp.o
[145/785] Building CXX object Source/Core/Common/CMakeFiles/common.dir/SettingsHandler.cpp.o
[145/785] Building CXX object Source/Core/Common/CMakeFiles/common.dir/x64FPURoundMode.cpp.o
[146/785] Building CXX object Source/Core/Common/CMakeFiles/common.dir/CDUtils.cpp.o
[146/785] Building CXX object Source/Core/Common/CMakeFiles/common.dir/x64CPUDetect.cpp.o
[147/785] Building CXX object Source/Core/Common/CMakeFiles/common.dir/SymbolDB.cpp.o
[147/785] Building CXX object Source/Core/Common/CMakeFiles/common.dir/GL/GLContext.cpp.o
[148/785] Building CXX object Source/Core/Common/CMakeFiles/common.dir/Logging/ConsoleListenerNix.cpp.o
[148/785] Building CXX object Source/Core/Common/CMakeFiles/common.dir/GL/GLUtil.cpp.o
[149/785] Building CXX object Source/Core/Common/CMakeFiles/common.dir/UPnP.cpp.o
[149/785] Building CXX object Source/Core/Common/CMakeFiles/common.dir/GL/GLExtensions/GLExtensions.cpp.o
[150/785] Building CXX object Source/Core/Common/CMakeFiles/common.dir/TraversalClient.cpp.o
[150/785] Building CXX object Source/Core/Common/CMakeFiles/common.dir/GL/GLInterface/EGL.cpp.o
[151/785] Building CXX object Source/Core/Common/CMakeFiles/common.dir/x64ABI.cpp.o
[151/785] Building CXX object Source/Core/Common/CMakeFiles/common.dir/GL/GLInterface/EGLX11.cpp.o
[152/785] Building CXX object Source/Core/Common/CMakeFiles/common.dir/x64FPURoundMode.cpp.o
[152/785] Building CXX object Source/Core/Common/CMakeFiles/common.dir/GL/GLX11Window.cpp.o
[153/785] Building CXX object Source/Core/Common/CMakeFiles/common.dir/DynamicLibrary.cpp.o
[153/785] Building CXX object Source/Core/Common/CMakeFiles/common.dir/GL/GLInterface/GLX.cpp.o
[154/785] Building CXX object Source/Core/Common/CMakeFiles/common.dir/GL/GLUtil.cpp.o
[154/785] Building CXX object Source/Core/Core/CMakeFiles/core.dir/ActionReplay.cpp.o
[155/785] Building CXX object Source/Core/Common/CMakeFiles/common.dir/GL/GLContext.cpp.o
[155/785] Building CXX object Source/Core/Core/CMakeFiles/core.dir/Analytics.cpp.o
[156/785] Building CXX object Source/Core/Common/CMakeFiles/common.dir/x64CPUDetect.cpp.o
[156/785] Building CXX object Source/Core/Core/CMakeFiles/core.dir/ARDecrypt.cpp.o
[157/785] Building CXX object Source/Core/Common/CMakeFiles/common.dir/GL/GLInterface/EGLX11.cpp.o
[157/785] Building CXX object Source/Core/Core/CMakeFiles/core.dir/BootManager.cpp.o
[158/785] Building CXX object Source/Core/Common/CMakeFiles/common.dir/GL/GLX11Window.cpp.o
[158/785] Building CXX object Source/Core/Core/CMakeFiles/core.dir/ConfigManager.cpp.o
[159/785] Building CXX object Externals/glslang/CMakeFiles/glslang.dir/SPIRV/GlslangToSpv.cpp.o
[159/785] Linking CXX static library Externals/glslang/libglslang.a
[160/785] Building CXX object Source/Core/Common/CMakeFiles/common.dir/JitRegister.cpp.o
[160/785] Building CXX object Source/Core/Core/CMakeFiles/core.dir/Core.cpp.o
[161/785] Linking CXX static library Externals/glslang/libglslang.a
[161/785] Building CXX object Source/Core/Core/CMakeFiles/core.dir/CoreTiming.cpp.o
[162/785] Building CXX object Source/Core/Common/CMakeFiles/common.dir/GL/GLInterface/GLX.cpp.o
[162/785] Building CXX object Source/Core/Core/CMakeFiles/core.dir/DSPEmulator.cpp.o
[163/785] Building CXX object Source/Core/Core/CMakeFiles/core.dir/ARDecrypt.cpp.o
[163/785] Building CXX object Source/Core/Core/CMakeFiles/core.dir/GeckoCodeConfig.cpp.o
[164/785] Building CXX object Source/Core/Common/CMakeFiles/common.dir/GL/GLInterface/EGL.cpp.o
[164/785] Building CXX object Source/Core/Core/CMakeFiles/core.dir/GeckoCode.cpp.o
[165/785] Building CXX object Source/Core/Common/CMakeFiles/common.dir/x64Emitter.cpp.o
[165/785] Building CXX object Source/Core/Core/CMakeFiles/core.dir/HotkeyManager.cpp.o
[166/785] Building CXX object Source/Core/Common/CMakeFiles/common.dir/MD5.cpp.o
[166/785] Building CXX object Source/Core/Core/CMakeFiles/core.dir/LibusbUtils.cpp.o
[167/785] Building CXX object Source/Core/Common/CMakeFiles/common.dir/Network.cpp.o
[167/785] Building CXX object Source/Core/Core/CMakeFiles/core.dir/MemTools.cpp.o
[168/785] Building CXX object Source/Core/Core/CMakeFiles/core.dir/DSPEmulator.cpp.o
[168/785] Building CXX object Source/Core/Core/CMakeFiles/core.dir/Movie.cpp.o
[169/785] Building CXX object Source/Core/Common/CMakeFiles/common.dir/NandPaths.cpp.o
[169/785] Building CXX object Source/Core/Core/CMakeFiles/core.dir/NetPlayClient.cpp.o
[170/785] Building CXX object Source/Core/Common/CMakeFiles/common.dir/GekkoDisassembler.cpp.o
[170/785] Building CXX object Source/Core/Core/CMakeFiles/core.dir/NetPlayServer.cpp.o
[171/785] Building CXX object Source/Core/Common/CMakeFiles/common.dir/Logging/LogManager.cpp.o
[171/785] Building CXX object Source/Core/Core/CMakeFiles/core.dir/PatchEngine.cpp.o
[172/785] Building CXX object Source/Core/Core/CMakeFiles/core.dir/MemTools.cpp.o
[172/785] Building CXX object Source/Core/Core/CMakeFiles/core.dir/State.cpp.o
[173/785] Building CXX object Source/Core/Core/CMakeFiles/core.dir/Analytics.cpp.o
[173/785] Building CXX object Source/Core/Core/CMakeFiles/core.dir/SysConf.cpp.o
[174/785] Building CXX object Source/Core/Core/CMakeFiles/core.dir/LibusbUtils.cpp.o
[174/785] Building CXX object Source/Core/Core/CMakeFiles/core.dir/TitleDatabase.cpp.o
[175/785] Building CXX object Source/Core/Core/CMakeFiles/core.dir/ActionReplay.cpp.o
[175/785] Building CXX object Source/Core/Core/CMakeFiles/core.dir/WiiRoot.cpp.o
[176/785] Building CXX object Source/Core/Common/CMakeFiles/common.dir/Timer.cpp.o
[176/785] Building CXX object Source/Core/Core/CMakeFiles/core.dir/WiiUtils.cpp.o
[177/785] Building CXX object Source/Core/Core/CMakeFiles/core.dir/CoreTiming.cpp.o
[177/785] Building CXX object Source/Core/Core/CMakeFiles/core.dir/Boot/Boot_BS2Emu.cpp.o
[178/785] Building CXX object Source/Core/Core/CMakeFiles/core.dir/GeckoCode.cpp.o
[178/785] Building CXX object Source/Core/Core/CMakeFiles/core.dir/Boot/Boot.cpp.o
[179/785] Building CXX object Source/Core/Common/CMakeFiles/common.dir/StringUtil.cpp.o
[179/785] Building CXX object Source/Core/Core/CMakeFiles/core.dir/Boot/Boot_WiiWAD.cpp.o
[180/785] Building CXX object Source/Core/Core/CMakeFiles/core.dir/GeckoCodeConfig.cpp.o
[180/785] Building CXX object Source/Core/VideoCommon/CMakeFiles/videocommon.dir/VertexLoaderManager.cpp.o
[181/785] Building CXX object Source/Core/Core/CMakeFiles/core.dir/Core.cpp.o
[181/785] Building CXX object Source/Core/VideoCommon/CMakeFiles/videocommon.dir/VertexLoader_Color.cpp.o
[182/785] Building CXX object Source/Core/Core/CMakeFiles/core.dir/BootManager.cpp.o
[182/785] Building CXX object Source/Core/VideoCommon/CMakeFiles/videocommon.dir/VertexLoader_Normal.cpp.o
[183/785] Building CXX object Source/Core/Core/CMakeFiles/core.dir/HotkeyManager.cpp.o
[183/785] Building CXX object Source/Core/VideoCommon/CMakeFiles/videocommon.dir/VertexLoader_Position.cpp.o
[184/785] Building CXX object Source/Core/Core/CMakeFiles/core.dir/PatchEngine.cpp.o
[184/785] Building CXX object Source/Core/Core/CMakeFiles/core.dir/Boot/DolReader.cpp.o
[185/785] Building CXX object Source/Core/VideoCommon/CMakeFiles/videocommon.dir/VertexLoader_Color.cpp.o
[185/785] Building CXX object Source/Core/Core/CMakeFiles/core.dir/Config/GraphicsSettings.cpp.o
[186/785] Building CXX object Source/Core/Core/CMakeFiles/core.dir/TitleDatabase.cpp.o
[186/785] Building CXX object Source/Core/Core/CMakeFiles/core.dir/Config/MainSettings.cpp.o
[187/785] Building CXX object Source/Core/Core/CMakeFiles/core.dir/Boot/Boot_WiiWAD.cpp.o
[187/785] Building CXX object Source/Core/Core/CMakeFiles/core.dir/Config/NetplaySettings.cpp.o
[188/785] Building CXX object Source/Core/VideoCommon/CMakeFiles/videocommon.dir/VertexLoader_Normal.cpp.o
[188/785] Building CXX object Source/Core/Core/CMakeFiles/core.dir/Config/SYSCONFSettings.cpp.o
[189/785] Building CXX object Source/Core/Core/CMakeFiles/core.dir/WiiRoot.cpp.o
[189/785] Building CXX object Source/Core/Core/CMakeFiles/core.dir/Config/UISettings.cpp.o
[190/785] Building CXX object Source/Core/Core/CMakeFiles/core.dir/SysConf.cpp.o
[190/785] Building CXX object Source/Core/Core/CMakeFiles/core.dir/ConfigLoaders/BaseConfigLoader.cpp.o
[191/785] Building CXX object Source/Core/Core/CMakeFiles/core.dir/State.cpp.o
[191/785] Building CXX object Source/Core/Core/CMakeFiles/core.dir/ConfigLoaders/GameConfigLoader.cpp.o
[192/785] Building CXX object Source/Core/VideoCommon/CMakeFiles/videocommon.dir/VertexLoader_Position.cpp.o
[192/785] Building CXX object Source/Core/Core/CMakeFiles/core.dir/ConfigLoaders/IsSettingSaveable.cpp.o
[193/785] Building CXX object Source/Core/Core/CMakeFiles/core.dir/Boot/Boot_BS2Emu.cpp.o
902
In file included from ../Source/Core/Core/Boot/Boot.h:19,
903
                 from ../Source/Core/Core/Boot/Boot_BS2Emu.cpp:17:
904
../Source/Core/DiscIO/Volume.h: In static member function 'static bool CBoot::RunApploader(bool, const DiscIO::Volume&)':
905
../Source/Core/DiscIO/Volume.h:52:15: warning: '<anonymous>' may be used uninitialized in this function [-Wmaybe-uninitialized]
906
       return {};
907
               ^
908
../Source/Core/DiscIO/Volume.h:52:15: warning: '<anonymous>' may be used uninitialized in this function [-Wmaybe-uninitialized]
909
       return {};
910
               ^
911
../Source/Core/DiscIO/Volume.h:52:15: warning: '<anonymous>' may be used uninitialized in this function [-Wmaybe-uninitialized]
912
       return {};
913
               ^
914
[193/785] Building CXX object Source/Core/Core/CMakeFiles/core.dir/ConfigLoaders/MovieConfigLoader.cpp.o
[194/785] Building CXX object Source/Core/Core/CMakeFiles/core.dir/Config/GraphicsSettings.cpp.o
[194/785] Building CXX object Source/Core/Core/CMakeFiles/core.dir/ConfigLoaders/NetPlayConfigLoader.cpp.o
[195/785] Building CXX object Source/Core/Core/CMakeFiles/core.dir/Config/UISettings.cpp.o
[195/785] Building CXX object Source/Core/Core/CMakeFiles/core.dir/Debugger/Debugger_SymbolMap.cpp.o
[196/785] Building CXX object Source/Core/Core/CMakeFiles/core.dir/Config/NetplaySettings.cpp.o
[196/785] Building CXX object Source/Core/Core/CMakeFiles/core.dir/Debugger/Dump.cpp.o
[197/785] Building CXX object Source/Core/Core/CMakeFiles/core.dir/Boot/DolReader.cpp.o
[197/785] Building CXX object Source/Core/Core/CMakeFiles/core.dir/Debugger/PPCDebugInterface.cpp.o
[198/785] Building CXX object Source/Core/Core/CMakeFiles/core.dir/ConfigManager.cpp.o
[198/785] Building CXX object Source/Core/Core/CMakeFiles/core.dir/Debugger/RSO.cpp.o
[199/785] Building CXX object Source/Core/Core/CMakeFiles/core.dir/Config/SYSCONFSettings.cpp.o
[199/785] Building CXX object Source/Core/Core/CMakeFiles/core.dir/DSP/DSPAccelerator.cpp.o
[200/785] Building CXX object Source/Core/Core/CMakeFiles/core.dir/Config/MainSettings.cpp.o
[200/785] Building CXX object Source/Core/Core/CMakeFiles/core.dir/DSP/DSPAnalyzer.cpp.o
[201/785] Building CXX object Source/Core/Core/CMakeFiles/core.dir/Debugger/Dump.cpp.o
[201/785] Building CXX object Source/Core/Core/CMakeFiles/core.dir/DSP/DSPAssembler.cpp.o
[202/785] Building CXX object Source/Core/VideoCommon/CMakeFiles/videocommon.dir/VertexLoaderManager.cpp.o
[202/785] Building CXX object Source/Core/Core/CMakeFiles/core.dir/DSP/DSPCaptureLogger.cpp.o
[203/785] Building CXX object Source/Core/Core/CMakeFiles/core.dir/Boot/Boot.cpp.o
[203/785] Building CXX object Source/Core/Core/CMakeFiles/core.dir/DSP/DSPCodeUtil.cpp.o
[204/785] Building CXX object Source/Core/Core/CMakeFiles/core.dir/DSP/DSPAnalyzer.cpp.o
[204/785] Building CXX object Source/Core/Core/CMakeFiles/core.dir/DSP/DSPCore.cpp.o
[205/785] Building CXX object Source/Core/Core/CMakeFiles/core.dir/DSP/DSPAccelerator.cpp.o
[205/785] Building CXX object Source/Core/Core/CMakeFiles/core.dir/DSP/DSPDisassembler.cpp.o
[206/785] Building CXX object Source/Core/Core/CMakeFiles/core.dir/WiiUtils.cpp.o
[206/785] Building CXX object Source/Core/Core/CMakeFiles/core.dir/DSP/DSPHWInterface.cpp.o
[207/785] Building CXX object Source/Core/Core/CMakeFiles/core.dir/DSP/DSPCaptureLogger.cpp.o
[207/785] Building CXX object Source/Core/Core/CMakeFiles/core.dir/DSP/DSPMemoryMap.cpp.o
[208/785] Building CXX object Source/Core/Core/CMakeFiles/core.dir/Debugger/Debugger_SymbolMap.cpp.o
[208/785] Building CXX object Source/Core/Core/CMakeFiles/core.dir/DSP/DSPStacks.cpp.o
[209/785] Building CXX object Source/Core/Core/CMakeFiles/core.dir/ConfigLoaders/BaseConfigLoader.cpp.o
[209/785] Building CXX object Source/Core/Core/CMakeFiles/core.dir/DSP/DSPTables.cpp.o
[210/785] Building CXX object Source/Core/Core/CMakeFiles/core.dir/Debugger/PPCDebugInterface.cpp.o
[210/785] Building CXX object Source/Core/Core/CMakeFiles/core.dir/DSP/LabelMap.cpp.o
[211/785] Building CXX object Source/Core/Core/CMakeFiles/core.dir/DSP/DSPMemoryMap.cpp.o
[211/785] Building CXX object Source/Core/Core/CMakeFiles/core.dir/DSP/Interpreter/DSPIntArithmetic.cpp.o
[212/785] Building CXX object Source/Core/Core/CMakeFiles/core.dir/DSP/DSPCore.cpp.o
[212/785] Building CXX object Source/Core/Core/CMakeFiles/core.dir/DSP/Interpreter/DSPIntCCUtil.cpp.o
[213/785] Building CXX object Source/Core/Core/CMakeFiles/core.dir/Debugger/RSO.cpp.o
[213/785] Building CXX object Source/Core/Core/CMakeFiles/core.dir/DSP/Interpreter/DSPInterpreter.cpp.o
[214/785] Building CXX object Source/Core/Core/CMakeFiles/core.dir/ConfigLoaders/MovieConfigLoader.cpp.o
[214/785] Building CXX object Source/Core/Core/CMakeFiles/core.dir/DSP/Interpreter/DSPIntExtOps.cpp.o
[215/785] Building CXX object Source/Core/Core/CMakeFiles/core.dir/DSP/DSPCodeUtil.cpp.o
[215/785] Building CXX object Source/Core/Core/CMakeFiles/core.dir/DSP/Interpreter/DSPIntLoadStore.cpp.o
[216/785] Building CXX object Source/Core/Core/CMakeFiles/core.dir/ConfigLoaders/NetPlayConfigLoader.cpp.o
[216/785] Building CXX object Source/Core/Core/CMakeFiles/core.dir/DSP/Interpreter/DSPIntMisc.cpp.o
[217/785] Building CXX object Source/Core/Core/CMakeFiles/core.dir/DSP/DSPDisassembler.cpp.o
[217/785] Building CXX object Source/Core/Core/CMakeFiles/core.dir/DSP/Interpreter/DSPIntMultiplier.cpp.o
[218/785] Building CXX object Source/Core/Core/CMakeFiles/core.dir/DSP/DSPStacks.cpp.o
[218/785] Building CXX object Source/Core/Core/CMakeFiles/core.dir/DSP/Interpreter/DSPIntTables.cpp.o
[219/785] Building CXX object Source/Core/Core/CMakeFiles/core.dir/DSP/DSPAssembler.cpp.o
[219/785] Building CXX object Source/Core/Core/CMakeFiles/core.dir/DSP/Jit/DSPEmitterBase.cpp.o
[220/785] Building CXX object Source/Core/Core/CMakeFiles/core.dir/DSP/DSPHWInterface.cpp.o
[220/785] Building CXX object Source/Core/Core/CMakeFiles/core.dir/FifoPlayer/FifoAnalyzer.cpp.o
[221/785] Building CXX object Source/Core/Core/CMakeFiles/core.dir/ConfigLoaders/IsSettingSaveable.cpp.o
[221/785] Building CXX object Source/Core/Core/CMakeFiles/core.dir/FifoPlayer/FifoDataFile.cpp.o
[222/785] Building CXX object Source/Core/Core/CMakeFiles/core.dir/DSP/DSPTables.cpp.o
[222/785] Building CXX object Source/Core/Core/CMakeFiles/core.dir/FifoPlayer/FifoPlaybackAnalyzer.cpp.o
[223/785] Building CXX object Source/Core/Core/CMakeFiles/core.dir/DSP/Interpreter/DSPIntCCUtil.cpp.o
[223/785] Building CXX object Source/Core/Core/CMakeFiles/core.dir/FifoPlayer/FifoPlayer.cpp.o
[224/785] Building CXX object Source/Core/Core/CMakeFiles/core.dir/DSP/LabelMap.cpp.o
[224/785] Building CXX object Source/Core/Core/CMakeFiles/core.dir/FifoPlayer/FifoRecordAnalyzer.cpp.o
[225/785] Building CXX object Source/Core/Core/CMakeFiles/core.dir/DSP/Interpreter/DSPInterpreter.cpp.o
[225/785] Building CXX object Source/Core/Core/CMakeFiles/core.dir/FifoPlayer/FifoRecorder.cpp.o
[226/785] Building CXX object Source/Core/Core/CMakeFiles/core.dir/DSP/Interpreter/DSPIntArithmetic.cpp.o
[226/785] Building CXX object Source/Core/Core/CMakeFiles/core.dir/HLE/HLE.cpp.o
[227/785] Building CXX object Source/Core/Core/CMakeFiles/core.dir/DSP/Interpreter/DSPIntMisc.cpp.o
[227/785] Building CXX object Source/Core/Core/CMakeFiles/core.dir/HLE/HLE_Misc.cpp.o
[228/785] Building CXX object Source/Core/Core/CMakeFiles/core.dir/DSP/Interpreter/DSPIntTables.cpp.o
[228/785] Building CXX object Source/Core/Core/CMakeFiles/core.dir/HLE/HLE_OS.cpp.o
[229/785] Building CXX object Source/Core/Core/CMakeFiles/core.dir/DSP/Interpreter/DSPIntMultiplier.cpp.o
[229/785] Building CXX object Source/Core/Core/CMakeFiles/core.dir/HLE/HLE_VarArgs.cpp.o
[230/785] Building CXX object Source/Core/Core/CMakeFiles/core.dir/DSP/Interpreter/DSPIntLoadStore.cpp.o
[230/785] Building CXX object Source/Core/Core/CMakeFiles/core.dir/HW/AddressSpace.cpp.o
[231/785] Building CXX object Source/Core/Core/CMakeFiles/core.dir/FifoPlayer/FifoAnalyzer.cpp.o
[231/785] Building CXX object Source/Core/Core/CMakeFiles/core.dir/HW/AudioInterface.cpp.o
[232/785] Building CXX object Source/Core/Core/CMakeFiles/core.dir/DSP/Interpreter/DSPIntExtOps.cpp.o
[232/785] Building CXX object Source/Core/Core/CMakeFiles/core.dir/HW/CPU.cpp.o
[233/785] Building CXX object Source/Core/Core/CMakeFiles/core.dir/DSP/Jit/DSPEmitterBase.cpp.o
[233/785] Building CXX object Source/Core/Core/CMakeFiles/core.dir/HW/DSP.cpp.o
[234/785] Building CXX object Source/Core/Core/CMakeFiles/core.dir/HLE/HLE_Misc.cpp.o
[234/785] Building CXX object Source/Core/Core/CMakeFiles/core.dir/HW/DSPHLE/UCodes/AX.cpp.o
[235/785] Building CXX object Source/Core/Core/CMakeFiles/core.dir/HLE/HLE_VarArgs.cpp.o
[235/785] Building CXX object Source/Core/Core/CMakeFiles/core.dir/HW/DSPHLE/UCodes/AXWii.cpp.o
[236/785] Building CXX object Source/Core/Core/CMakeFiles/core.dir/FifoPlayer/FifoPlaybackAnalyzer.cpp.o
[236/785] Building CXX object Source/Core/Core/CMakeFiles/core.dir/HW/DSPHLE/UCodes/CARD.cpp.o
[237/785] Building CXX object Source/Core/Core/CMakeFiles/core.dir/ConfigLoaders/GameConfigLoader.cpp.o
[237/785] Building CXX object Source/Core/Core/CMakeFiles/core.dir/HW/DSPHLE/UCodes/GBA.cpp.o
[238/785] Building CXX object Source/Core/Core/CMakeFiles/core.dir/FifoPlayer/FifoRecordAnalyzer.cpp.o
[238/785] Building CXX object Source/Core/Core/CMakeFiles/core.dir/HW/DSPHLE/UCodes/INIT.cpp.o
[239/785] Building CXX object Source/Core/Core/CMakeFiles/core.dir/FifoPlayer/FifoDataFile.cpp.o
[239/785] Building CXX object Source/Core/Core/CMakeFiles/core.dir/HW/DSPHLE/UCodes/ROM.cpp.o
[240/785] Building CXX object Source/Core/Core/CMakeFiles/core.dir/HLE/HLE_OS.cpp.o
[240/785] Building CXX object Source/Core/Core/CMakeFiles/core.dir/HW/DSPHLE/UCodes/UCodes.cpp.o
[241/785] Building CXX object Source/Core/Core/CMakeFiles/core.dir/Movie.cpp.o
[241/785] Building CXX object Source/Core/Core/CMakeFiles/core.dir/HW/DSPHLE/UCodes/Zelda.cpp.o
[242/785] Building CXX object Source/Core/Core/CMakeFiles/core.dir/NetPlayServer.cpp.o
[242/785] Building CXX object Source/Core/Core/CMakeFiles/core.dir/HW/DSPHLE/MailHandler.cpp.o
[243/785] Building CXX object Source/Core/Core/CMakeFiles/core.dir/HW/DSPHLE/UCodes/CARD.cpp.o
[243/785] Building CXX object Source/Core/Core/CMakeFiles/core.dir/HW/DSPHLE/DSPHLE.cpp.o
[244/785] Building CXX object Source/Core/Core/CMakeFiles/core.dir/FifoPlayer/FifoPlayer.cpp.o
[244/785] Building CXX object Source/Core/Core/CMakeFiles/core.dir/HW/DSPLLE/DSPDebugInterface.cpp.o
[245/785] Building CXX object Source/Core/Core/CMakeFiles/core.dir/HW/DSPHLE/UCodes/GBA.cpp.o
[245/785] Building CXX object Source/Core/Core/CMakeFiles/core.dir/HW/DSPLLE/DSPHost.cpp.o
[246/785] Building CXX object Source/Core/Core/CMakeFiles/core.dir/NetPlayClient.cpp.o
915
In file included from ../Source/Core/Core/NetPlayClient.cpp:39:
916
../Source/Core/Core/GeckoCode.h: In member function 'unsigned int NetPlay::NetPlayClient::OnData(sf::Packet&)':
917
../Source/Core/Core/GeckoCode.h:16:7: warning: '<anonymous>.Gecko::GeckoCode::user_defined' may be used uninitialized in this function [-Wmaybe-uninitialized]
918
 class GeckoCode
919
       ^~~~~~~~~
920
[246/785] Building CXX object Source/Core/Core/CMakeFiles/core.dir/HW/DSPLLE/DSPSymbols.cpp.o
[247/785] Building CXX object Source/Core/Core/CMakeFiles/core.dir/HW/CPU.cpp.o
[247/785] Building CXX object Source/Core/Core/CMakeFiles/core.dir/HW/DSPLLE/DSPLLEGlobals.cpp.o
[248/785] Building CXX object Source/Core/Common/CMakeFiles/common.dir/GL/GLExtensions/GLExtensions.cpp.o
[248/785] Linking CXX static library Source/Core/Common/libcommon.a
[249/785] Building CXX object Source/Core/Core/CMakeFiles/core.dir/HW/AddressSpace.cpp.o
921
../Source/Core/Core/HW/AddressSpace.cpp: In constructor 'AddressSpace::SmallBlockAccessors::SmallBlockAccessors(u8**, u32)':
922
../Source/Core/Core/HW/AddressSpace.cpp:306:50: warning: declaration of 'size' shadows a member of 'AddressSpace::SmallBlockAccessors' [-Wshadow]
923
   SmallBlockAccessors(u8** alloc_base, u32 size) : alloc_base(alloc_base), size(size) {}
924
                                                  ^
925
../Source/Core/Core/HW/AddressSpace.cpp:356:7: note: shadowed declaration is here
926
   u32 size;
927
       ^~~~
928
../Source/Core/Core/HW/AddressSpace.cpp:306:50: warning: declaration of 'alloc_base' shadows a member of 'AddressSpace::SmallBlockAccessors' [-Wshadow]
929
   SmallBlockAccessors(u8** alloc_base, u32 size) : alloc_base(alloc_base), size(size) {}
930
                                                  ^
931
../Source/Core/Core/HW/AddressSpace.cpp:355:8: note: shadowed declaration is here
932
   u8** alloc_base;
933
        ^~~~~~~~~~
934
[249/785] Building CXX object Source/Core/Core/CMakeFiles/core.dir/HW/DSPLLE/DSPLLE.cpp.o
[250/785] Building CXX object Source/Core/Core/CMakeFiles/core.dir/HW/DSPHLE/UCodes/INIT.cpp.o
[250/785] Building CXX object Source/Core/Core/CMakeFiles/core.dir/HW/DVD/DVDInterface.cpp.o
[251/785] Linking CXX static library Source/Core/Common/libcommon.a
[251/785] Linking CXX executable Binaries/traversal_server
[252/785] Building CXX object Source/Core/Core/CMakeFiles/core.dir/FifoPlayer/FifoRecorder.cpp.o
[252/785] Building CXX object Source/Core/Core/CMakeFiles/core.dir/HW/DVD/DVDMath.cpp.o
[253/785] Building CXX object Source/Core/Core/CMakeFiles/core.dir/HLE/HLE.cpp.o
[253/785] Building CXX object Source/Core/Core/CMakeFiles/core.dir/HW/DVD/DVDThread.cpp.o
[254/785] Building CXX object Source/Core/Core/CMakeFiles/core.dir/HW/DSPHLE/UCodes/ROM.cpp.o
[254/785] Building CXX object Source/Core/Core/CMakeFiles/core.dir/HW/DVD/FileMonitor.cpp.o
[255/785] Linking CXX executable Binaries/traversal_server
[255/785] Building CXX object Source/Core/Core/CMakeFiles/core.dir/HW/EXI/EXI.cpp.o
[256/785] Building CXX object Source/Core/Core/CMakeFiles/core.dir/HW/DVD/DVDMath.cpp.o
[256/785] Building CXX object Source/Core/Core/CMakeFiles/core.dir/HW/EXI/EXI_Channel.cpp.o
[257/785] Building CXX object Source/Core/Core/CMakeFiles/core.dir/HW/AudioInterface.cpp.o
[257/785] Building CXX object Source/Core/Core/CMakeFiles/core.dir/HW/EXI/EXI_Device.cpp.o
[258/785] Building CXX object Source/Core/Core/CMakeFiles/core.dir/HW/DSPLLE/DSPLLEGlobals.cpp.o
[258/785] Building CXX object Source/Core/Core/CMakeFiles/core.dir/HW/EXI/EXI_DeviceAD16.cpp.o
[259/785] Building CXX object Source/Core/Core/CMakeFiles/core.dir/HW/DSPHLE/UCodes/UCodes.cpp.o
[259/785] Building CXX object Source/Core/Core/CMakeFiles/core.dir/HW/EXI/EXI_DeviceAGP.cpp.o
[260/785] Building CXX object Source/Core/Core/CMakeFiles/core.dir/HW/DSPHLE/MailHandler.cpp.o
[260/785] Building CXX object Source/Core/Core/CMakeFiles/core.dir/HW/EXI/EXI_DeviceDummy.cpp.o
[261/785] Building CXX object Source/Core/Core/CMakeFiles/core.dir/HW/DSP.cpp.o
[261/785] Building CXX object Source/Core/Core/CMakeFiles/core.dir/HW/EXI/EXI_DeviceEthernet.cpp.o
[262/785] Building CXX object Source/Core/Core/CMakeFiles/core.dir/HW/DSPLLE/DSPHost.cpp.o
[262/785] Building CXX object Source/Core/Core/CMakeFiles/core.dir/HW/EXI/EXI_DeviceGecko.cpp.o
[263/785] Building CXX object Source/Core/Core/CMakeFiles/core.dir/HW/DSPHLE/UCodes/AXWii.cpp.o
[263/785] Building CXX object Source/Core/Core/CMakeFiles/core.dir/HW/EXI/EXI_DeviceIPL.cpp.o
[264/785] Building CXX object Source/Core/Core/CMakeFiles/core.dir/HW/DSPLLE/DSPDebugInterface.cpp.o
[264/785] Building CXX object Source/Core/Core/CMakeFiles/core.dir/HW/EXI/EXI_DeviceMemoryCard.cpp.o
[265/785] Building CXX object Source/Core/Core/CMakeFiles/core.dir/HW/DSPLLE/DSPSymbols.cpp.o
[265/785] Building CXX object Source/Core/Core/CMakeFiles/core.dir/HW/EXI/EXI_DeviceMic.cpp.o
[266/785] Building CXX object Source/Core/Core/CMakeFiles/core.dir/HW/DSPHLE/DSPHLE.cpp.o
[266/785] Building CXX object Source/Core/Core/CMakeFiles/core.dir/HW/GCKeyboard.cpp.o
[267/785] Building CXX object Source/Core/Core/CMakeFiles/core.dir/HW/EXI/EXI_DeviceDummy.cpp.o
[267/785] Building CXX object Source/Core/Core/CMakeFiles/core.dir/HW/GCKeyboardEmu.cpp.o
[268/785] Building CXX object Source/Core/Core/CMakeFiles/core.dir/HW/DSPHLE/UCodes/AX.cpp.o
[268/785] Building CXX object Source/Core/Core/CMakeFiles/core.dir/HW/GCMemcard/GCIFile.cpp.o
[269/785] Building CXX object Source/Core/Core/CMakeFiles/core.dir/HW/EXI/EXI_DeviceAD16.cpp.o
[269/785] Building CXX object Source/Core/Core/CMakeFiles/core.dir/HW/GCMemcard/GCMemcard.cpp.o
[270/785] Building CXX object Source/Core/Core/CMakeFiles/core.dir/HW/EXI/EXI.cpp.o
[270/785] Building CXX object Source/Core/Core/CMakeFiles/core.dir/HW/GCMemcard/GCMemcardDirectory.cpp.o
[271/785] Building CXX object Source/Core/Core/CMakeFiles/core.dir/HW/EXI/EXI_Channel.cpp.o
[271/785] Building CXX object Source/Core/Core/CMakeFiles/core.dir/HW/GCMemcard/GCMemcardRaw.cpp.o
[272/785] Building CXX object Source/Core/Core/CMakeFiles/core.dir/HW/EXI/EXI_Device.cpp.o
[272/785] Building CXX object Source/Core/Core/CMakeFiles/core.dir/HW/GCPad.cpp.o
[273/785] Building CXX object Source/Core/Core/CMakeFiles/core.dir/HW/EXI/EXI_DeviceMic.cpp.o
[273/785] Building CXX object Source/Core/Core/CMakeFiles/core.dir/HW/GCPadEmu.cpp.o
[274/785] Building CXX object Source/Core/Core/CMakeFiles/core.dir/HW/EXI/EXI_DeviceAGP.cpp.o
[274/785] Building CXX object Source/Core/Core/CMakeFiles/core.dir/HW/GPFifo.cpp.o
[275/785] Building CXX object Source/Core/Core/CMakeFiles/core.dir/HW/EXI/EXI_DeviceEthernet.cpp.o
[275/785] Building CXX object Source/Core/Core/CMakeFiles/core.dir/HW/HW.cpp.o
[276/785] Building CXX object Source/Core/Core/CMakeFiles/core.dir/HW/DSPLLE/DSPLLE.cpp.o
[276/785] Building CXX object Source/Core/Core/CMakeFiles/core.dir/HW/Memmap.cpp.o
[277/785] Building CXX object Source/Core/Core/CMakeFiles/core.dir/HW/DSPHLE/UCodes/Zelda.cpp.o
[277/785] Building CXX object Source/Core/Core/CMakeFiles/core.dir/HW/MemoryInterface.cpp.o
[278/785] Building CXX object Source/Core/Core/CMakeFiles/core.dir/HW/DVD/FileMonitor.cpp.o
[278/785] Building CXX object Source/Core/Core/CMakeFiles/core.dir/HW/MMIO.cpp.o
[279/785] Building CXX object Source/Core/Core/CMakeFiles/core.dir/HW/GCKeyboard.cpp.o
[279/785] Building CXX object Source/Core/Core/CMakeFiles/core.dir/HW/ProcessorInterface.cpp.o
[280/785] Building CXX object Source/Core/Core/CMakeFiles/core.dir/HW/GCMemcard/GCIFile.cpp.o
[280/785] Building CXX object Source/Core/Core/CMakeFiles/core.dir/HW/SI/SI.cpp.o
[281/785] Building CXX object Source/Core/Core/CMakeFiles/core.dir/HW/DVD/DVDThread.cpp.o
[281/785] Building CXX object Source/Core/Core/CMakeFiles/core.dir/HW/SI/SI_Device.cpp.o
[282/785] Building CXX object Source/Core/Core/CMakeFiles/core.dir/HW/GPFifo.cpp.o
[282/785] Building CXX object Source/Core/Core/CMakeFiles/core.dir/HW/SI/SI_DeviceDanceMat.cpp.o
[283/785] Building CXX object Source/Core/Core/CMakeFiles/core.dir/HW/EXI/EXI_DeviceGecko.cpp.o
[283/785] Building CXX object Source/Core/Core/CMakeFiles/core.dir/HW/SI/SI_DeviceGBA.cpp.o
[284/785] Building CXX object Source/Core/Core/CMakeFiles/core.dir/HW/HW.cpp.o
[284/785] Building CXX object Source/Core/Core/CMakeFiles/core.dir/HW/SI/SI_DeviceGCAdapter.cpp.o
[285/785] Building CXX object Source/Core/Core/CMakeFiles/core.dir/HW/GCPad.cpp.o
[285/785] Building CXX object Source/Core/Core/CMakeFiles/core.dir/HW/SI/SI_DeviceGCController.cpp.o
[286/785] Building CXX object Source/Core/Core/CMakeFiles/core.dir/HW/SI/SI_DeviceDanceMat.cpp.o
[286/785] Building CXX object Source/Core/Core/CMakeFiles/core.dir/HW/SI/SI_DeviceGCSteeringWheel.cpp.o
[287/785] Building CXX object Source/Core/Core/CMakeFiles/core.dir/HW/EXI/EXI_DeviceIPL.cpp.o
935
../Source/Core/Core/HW/EXI/EXI_DeviceIPL.cpp: In member function 'virtual void ExpansionInterface::CEXIIPL::TransferByte(u8&)':
936
../Source/Core/Core/HW/EXI/EXI_DeviceIPL.cpp:290:30: warning: comparison of unsigned expression >= 0 is always true [-Wtype-limits]
937
 #define IN_RANGE(x) (address >= x##_BASE && address < x##_BASE + x##_SIZE)
938
                      ~~~~~~~~^~~~~~~~~~~~~~~~~~~~~~~~~~~~~~~~~~~~~~~~~~~~~
939
 #define DEV_ADDR(x) (address - x##_BASE)
940
 ~~~~~~~~~~~~~~~~~~~~~~~~~~~~~~~~~~~~~~~~
941
 #define DEV_ADDR_CURSOR(x) (DEV_ADDR(x) + m_cursor++)
942
 ~~~~~~~~~~~~~~~~~~~~~~~~~~~~~~~~~~~~~~~~~~~~~~~~~~~~~
943
 
944
                               
945
     auto UartFifoAccess = [&]() {
946
     ~~~~~~~~~~~~~~~~~~~~~~~~~~~~~
947
       if (m_command.is_write())
948
       ~~~~~~~~~~~~~~~~~~~~~~~~~
949
       {
950
       ~                       
951
         if (data != '\0')
952
         ~~~~~~~~~~~~~~~~~     
953
           m_buffer += data;
954
           ~~~~~~~~~~~~~~~~~   
955
 
956
                               
957
         if (data == '\r')
958
         ~~~~~~~~~~~~~~~~~     
959
         {
960
         ~                     
961
           NOTICE_LOG(OSREPORT, "%s", SHIFTJISToUTF8(m_buffer).c_str());
962
           ~~~~~~~~~~~~~~~~~~~~~~~~~~~~~~~~~~~~~~~~~~~~~~~~~~~~~~~~~~~~~
963
           m_buffer.clear();
964
           ~~~~~~~~~~~~~~~~~   
965
         }
966
         ~                     
967
       }
968
       ~                       
969
       else
970
       ~~~~                    
971
       {
972
       ~                       
973
         // "Queue Length"... return 0 cause we're instant
974
         ~~~~~~~~~~~~~~~~~~~~~~~~~~~~~~~~~~~~~~~~~~~~~~~~~
975
         data = 0;
976
         ~~~~~~~~~             
977
       }
978
       ~                       
979
     };
980
     ~~                        
981
 
982
                               
983
     if (IN_RANGE(ROM))
984
     ~~~~~~~~~~~~~~~~          
985
../Source/Core/Core/HW/EXI/EXI_DeviceIPL.cpp:313:9: note: in expansion of macro 'IN_RANGE'
986
     if (IN_RANGE(ROM))
987
         ^~~~~~~~
988
[287/785] Building CXX object Source/Core/Core/CMakeFiles/core.dir/HW/SI/SI_DeviceKeyboard.cpp.o
[288/785] Building CXX object Source/Core/Core/CMakeFiles/core.dir/HW/GCKeyboardEmu.cpp.o
[288/785] Building CXX object Source/Core/Core/CMakeFiles/core.dir/HW/SI/SI_DeviceNull.cpp.o
[289/785] Building CXX object Source/Core/Core/CMakeFiles/core.dir/HW/GCMemcard/GCMemcardRaw.cpp.o
[289/785] Building CXX object Source/Core/Core/CMakeFiles/core.dir/HW/Sram.cpp.o
[290/785] Building CXX object Source/Core/Core/CMakeFiles/core.dir/HW/MemoryInterface.cpp.o
[290/785] Building CXX object Source/Core/Core/CMakeFiles/core.dir/HW/StreamADPCM.cpp.o
[291/785] Building CXX object Source/Core/Core/CMakeFiles/core.dir/HW/DVD/DVDInterface.cpp.o
[291/785] Building CXX object Source/Core/Core/CMakeFiles/core.dir/HW/SystemTimers.cpp.o
[292/785] Building CXX object Source/Core/Core/CMakeFiles/core.dir/HW/Memmap.cpp.o
[292/785] Building CXX object Source/Core/Core/CMakeFiles/core.dir/HW/VideoInterface.cpp.o
[293/785] Building CXX object Source/Core/Core/CMakeFiles/core.dir/HW/EXI/EXI_DeviceMemoryCard.cpp.o
[293/785] Building CXX object Source/Core/Core/CMakeFiles/core.dir/HW/WII_IPC.cpp.o
[294/785] Building CXX object Source/Core/Core/CMakeFiles/core.dir/HW/ProcessorInterface.cpp.o
[294/785] Building CXX object Source/Core/Core/CMakeFiles/core.dir/HW/Wiimote.cpp.o
[295/785] Building CXX object Source/Core/Core/CMakeFiles/core.dir/HW/SI/SI_Device.cpp.o
[295/785] Building CXX object Source/Core/Core/CMakeFiles/core.dir/HW/WiimoteCommon/DataReport.cpp.o
[296/785] Building CXX object Source/Core/Core/CMakeFiles/core.dir/HW/SI/SI_DeviceGCAdapter.cpp.o
[296/785] Building CXX object Source/Core/Core/CMakeFiles/core.dir/HW/WiimoteEmu/Camera.cpp.o
[297/785] Building CXX object Source/Core/Core/CMakeFiles/core.dir/HW/SI/SI_DeviceNull.cpp.o
[297/785] Building CXX object Source/Core/Core/CMakeFiles/core.dir/HW/WiimoteEmu/Dynamics.cpp.o
[298/785] Building CXX object Source/Core/Core/CMakeFiles/core.dir/HW/Sram.cpp.o
[298/785] Building CXX object Source/Core/Core/CMakeFiles/core.dir/HW/WiimoteEmu/EmuSubroutines.cpp.o
[299/785] Building CXX object Source/Core/Core/CMakeFiles/core.dir/HW/SI/SI_DeviceGCSteeringWheel.cpp.o
[299/785] Building CXX object Source/Core/Core/CMakeFiles/core.dir/HW/WiimoteEmu/Encryption.cpp.o
[300/785] Building CXX object Source/Core/Core/CMakeFiles/core.dir/HW/SI/SI.cpp.o
[300/785] Building CXX object Source/Core/Core/CMakeFiles/core.dir/HW/WiimoteEmu/ExtensionPort.cpp.o
[301/785] Building CXX object Source/Core/Core/CMakeFiles/core.dir/HW/SI/SI_DeviceKeyboard.cpp.o
[301/785] Building CXX object Source/Core/Core/CMakeFiles/core.dir/HW/WiimoteEmu/I2CBus.cpp.o
[302/785] Building CXX object Source/Core/Core/CMakeFiles/core.dir/HW/StreamADPCM.cpp.o
[302/785] Building CXX object Source/Core/Core/CMakeFiles/core.dir/HW/WiimoteEmu/MotionPlus.cpp.o
[303/785] Building CXX object Source/Core/Core/CMakeFiles/core.dir/HW/GCPadEmu.cpp.o
[303/785] Building CXX object Source/Core/Core/CMakeFiles/core.dir/HW/WiimoteEmu/Speaker.cpp.o
[304/785] Building CXX object Source/Core/Core/CMakeFiles/core.dir/HW/SI/SI_DeviceGCController.cpp.o
[304/785] Building CXX object Source/Core/Core/CMakeFiles/core.dir/HW/WiimoteEmu/WiimoteEmu.cpp.o
[305/785] Building CXX object Source/Core/Core/CMakeFiles/core.dir/HW/SI/SI_DeviceGBA.cpp.o
[305/785] Building CXX object Source/Core/Core/CMakeFiles/core.dir/HW/WiimoteEmu/Extension/Classic.cpp.o
[306/785] Building CXX object Source/Core/Core/CMakeFiles/core.dir/HW/GCMemcard/GCMemcard.cpp.o
989
../Source/Core/Core/HW/GCMemcard/GCMemcard.cpp:271:21: warning: no previous declaration for 'std::pair<short unsigned int, short unsigned int> CalculateMemcardChecksums(const u8*, size_t)' [-Wmissing-declarations]
990
 std::pair<u16, u16> CalculateMemcardChecksums(const u8* data, size_t size)
991
                     ^~~~~~~~~~~~~~~~~~~~~~~~~
992
../Source/Core/Core/HW/GCMemcard/GCMemcard.cpp: In member function 'GCMemcardRemoveFileRetVal GCMemcard::RemoveFile(u8)':
993
../Source/Core/Core/HW/GCMemcard/GCMemcard.cpp:801:63: warning: 'void* memset(void*, int, size_t)' writing to an object of non-trivial type 'std::array<DEntry, 127>::value_type' {aka 'struct DEntry'}; use assignment instead [-Wclass-memaccess]
994
   memset(&(UpdatedDir.m_dir_entries[index]), 0xFF, DENTRY_SIZE);
995
                                                               ^
996
In file included from ../Source/Core/Core/HW/GCMemcard/GCMemcard.cpp:5:
997
../Source/Core/Core/HW/GCMemcard/GCMemcard.h:198:8: note: 'std::array<DEntry, 127>::value_type' {aka 'struct DEntry'} declared here
998
 struct DEntry
999
        ^~~~~~
1000
../Source/Core/Core/HW/GCMemcard/GCMemcard.cpp: In member function 'GCMemcardExportFileRetVal GCMemcard::ExportGci(u8, const string&, const string&) const':
1001
../Source/Core/Core/HW/GCMemcard/GCMemcard.cpp:975:10: warning: enumeration value 'SUCCESS' not handled in switch [-Wswitch]
1002
   switch (GetSaveData(index, saveData))
1003
          ^
1004
[306/785] Building CXX object Source/Core/Core/CMakeFiles/core.dir/HW/WiimoteEmu/Extension/DrawsomeTablet.cpp.o
[307/785] Building CXX object Source/Core/Core/CMakeFiles/core.dir/HW/WiimoteEmu/Encryption.cpp.o
1005
../Source/Core/Core/HW/WiimoteEmu/Encryption.cpp: In member function 'virtual WiimoteEmu::EncryptionKey::KeyData WiimoteEmu::KeyGen3rdParty::GenerateKeyData(const RandData&, u32) const':
1006
../Source/Core/Core/HW/WiimoteEmu/Encryption.cpp:481:24: warning: suggest parentheses around arithmetic in operand of '^' [-Wparentheses]
1007
       u8(t0[7] ^ t0[6] + rol8(ans[0] ^ t0[0], t0[1])),
1008
../Source/Core/Core/HW/WiimoteEmu/Encryption.cpp:482:24: warning: suggest parentheses around arithmetic in operand of '^' [-Wparentheses]
1009
       u8(t0[1] ^ t0[3] + rol8(ans[1] ^ t0[4], t0[2])),
1010
../Source/Core/Core/HW/WiimoteEmu/Encryption.cpp:483:24: warning: suggest parentheses around arithmetic in operand of '^' [-Wparentheses]
1011
       u8(t0[5] ^ t0[4] + rol8(ans[2] ^ t0[2], t0[8])),
1012
../Source/Core/Core/HW/WiimoteEmu/Encryption.cpp:484:24: warning: suggest parentheses around arithmetic in operand of '^' [-Wparentheses]
1013
       u8(t0[0] ^ t0[7] + rol8(ans[3] ^ t0[6], t0[9])),
1014
../Source/Core/Core/HW/WiimoteEmu/Encryption.cpp:485:24: warning: suggest parentheses around arithmetic in operand of '^' [-Wparentheses]
1015
       u8(t0[1] ^ t0[8] + rol8(ans[4] ^ t0[5], t0[4])),
1016
../Source/Core/Core/HW/WiimoteEmu/Encryption.cpp:486:24: warning: suggest parentheses around arithmetic in operand of '^' [-Wparentheses]
1017
       u8(t0[5] ^ t0[8] + rol8(ans[5] ^ t0[9], t0[3])),
1018
[307/785] Building CXX object Source/Core/Core/CMakeFiles/core.dir/HW/WiimoteEmu/Extension/Drums.cpp.o
[308/785] Building CXX object Source/Core/Core/CMakeFiles/core.dir/HW/MMIO.cpp.o
[308/785] Building CXX object Source/Core/Core/CMakeFiles/core.dir/HW/WiimoteEmu/Extension/Extension.cpp.o
[309/785] Building CXX object Source/Core/Core/CMakeFiles/core.dir/HW/WiimoteEmu/I2CBus.cpp.o
[309/785] Building CXX object Source/Core/Core/CMakeFiles/core.dir/HW/WiimoteEmu/Extension/Nunchuk.cpp.o
[310/785] Building CXX object Source/Core/Core/CMakeFiles/core.dir/HW/SystemTimers.cpp.o
[310/785] Building CXX object Source/Core/Core/CMakeFiles/core.dir/HW/WiimoteEmu/Extension/Guitar.cpp.o
[311/785] Building CXX object Source/Core/Core/CMakeFiles/core.dir/HW/WII_IPC.cpp.o
[311/785] Building CXX object Source/Core/Core/CMakeFiles/core.dir/HW/WiimoteEmu/Extension/TaTaCon.cpp.o
[312/785] Building CXX object Source/Core/Core/CMakeFiles/core.dir/HW/GCMemcard/GCMemcardDirectory.cpp.o
[312/785] Building CXX object Source/Core/Core/CMakeFiles/core.dir/HW/WiimoteEmu/Extension/Turntable.cpp.o
[313/785] Building CXX object Source/Core/Core/CMakeFiles/core.dir/HW/WiimoteEmu/Camera.cpp.o
[313/785] Building CXX object Source/Core/Core/CMakeFiles/core.dir/HW/WiimoteEmu/Extension/UDrawTablet.cpp.o
[314/785] Building CXX object Source/Core/Core/CMakeFiles/core.dir/HW/WiimoteEmu/ExtensionPort.cpp.o
[314/785] Building CXX object Source/Core/Core/CMakeFiles/core.dir/HW/WiimoteReal/WiimoteReal.cpp.o
[315/785] Building CXX object Source/Core/Core/CMakeFiles/core.dir/HW/WiimoteCommon/DataReport.cpp.o
[315/785] Building CXX object Source/Core/Core/CMakeFiles/core.dir/HW/WiiSave.cpp.o
[316/785] Building CXX object Source/Core/Core/CMakeFiles/core.dir/HW/Wiimote.cpp.o
[316/785] Building CXX object Source/Core/Core/CMakeFiles/core.dir/IOS/Device.cpp.o
[317/785] Building CXX object Source/Core/Core/CMakeFiles/core.dir/HW/WiimoteEmu/Dynamics.cpp.o
[317/785] Building CXX object Source/Core/Core/CMakeFiles/core.dir/IOS/DeviceStub.cpp.o
[318/785] Building CXX object Source/Core/Core/CMakeFiles/core.dir/HW/VideoInterface.cpp.o
[318/785] Building CXX object Source/Core/Core/CMakeFiles/core.dir/IOS/IOS.cpp.o
[319/785] Building CXX object Source/Core/Core/CMakeFiles/core.dir/HW/WiimoteEmu/MotionPlus.cpp.o
[319/785] Building CXX object Source/Core/Core/CMakeFiles/core.dir/IOS/IOSC.cpp.o
[320/785] Building CXX object Source/Core/Core/CMakeFiles/core.dir/HW/WiimoteEmu/Extension/Classic.cpp.o
[320/785] Building CXX object Source/Core/Core/CMakeFiles/core.dir/IOS/MIOS.cpp.o
[321/785] Building CXX object Source/Core/Core/CMakeFiles/core.dir/HW/WiimoteEmu/Extension/Extension.cpp.o
[321/785] Building CXX object Source/Core/Core/CMakeFiles/core.dir/IOS/VersionInfo.cpp.o
[322/785] Building CXX object Source/Core/Core/CMakeFiles/core.dir/HW/WiimoteEmu/Speaker.cpp.o
[322/785] Building CXX object Source/Core/Core/CMakeFiles/core.dir/IOS/DI/DI.cpp.o
[323/785] Building CXX object Source/Core/Core/CMakeFiles/core.dir/HW/WiimoteEmu/EmuSubroutines.cpp.o
[323/785] Building CXX object Source/Core/Core/CMakeFiles/core.dir/IOS/ES/ES.cpp.o
[324/785] Building CXX object Source/Core/Core/CMakeFiles/core.dir/HW/WiimoteEmu/Extension/Nunchuk.cpp.o
[324/785] Building CXX object Source/Core/Core/CMakeFiles/core.dir/IOS/ES/Formats.cpp.o
[325/785] Building CXX object Source/Core/Core/CMakeFiles/core.dir/HW/WiimoteEmu/Extension/DrawsomeTablet.cpp.o
[325/785] Building CXX object Source/Core/Core/CMakeFiles/core.dir/IOS/ES/Identity.cpp.o
[326/785] Building CXX object Source/Core/Core/CMakeFiles/core.dir/HW/WiimoteEmu/Extension/Drums.cpp.o
[326/785] Building CXX object Source/Core/Core/CMakeFiles/core.dir/IOS/ES/NandUtils.cpp.o
[327/785] Building CXX object Source/Core/Core/CMakeFiles/core.dir/HW/WiimoteEmu/Extension/Guitar.cpp.o
[327/785] Building CXX object Source/Core/Core/CMakeFiles/core.dir/IOS/ES/TitleContents.cpp.o
[328/785] Building CXX object Source/Core/Core/CMakeFiles/core.dir/HW/WiimoteEmu/Extension/TaTaCon.cpp.o
[328/785] Building CXX object Source/Core/Core/CMakeFiles/core.dir/IOS/ES/TitleInformation.cpp.o
[329/785] Building CXX object Source/Core/Core/CMakeFiles/core.dir/IOS/DeviceStub.cpp.o
[329/785] Building CXX object Source/Core/Core/CMakeFiles/core.dir/IOS/ES/TitleManagement.cpp.o
[330/785] Building CXX object Source/Core/Core/CMakeFiles/core.dir/IOS/VersionInfo.cpp.o
[330/785] Building CXX object Source/Core/Core/CMakeFiles/core.dir/IOS/ES/Views.cpp.o
[331/785] Building CXX object Source/Core/Core/CMakeFiles/core.dir/IOS/MIOS.cpp.o
[331/785] Building CXX object Source/Core/Core/CMakeFiles/core.dir/IOS/FS/FileSystem.cpp.o
[332/785] Building CXX object Source/Core/Core/CMakeFiles/core.dir/HW/WiimoteEmu/Extension/UDrawTablet.cpp.o
[332/785] Building CXX object Source/Core/Core/CMakeFiles/core.dir/IOS/FS/FileSystemProxy.cpp.o
[333/785] Building CXX object Source/Core/Core/CMakeFiles/core.dir/HW/WiimoteEmu/Extension/Turntable.cpp.o
[333/785] Building CXX object Source/Core/Core/CMakeFiles/core.dir/IOS/FS/HostBackend/File.cpp.o
[334/785] Building CXX object Source/Core/Core/CMakeFiles/core.dir/IOS/Device.cpp.o
[334/785] Building CXX object Source/Core/Core/CMakeFiles/core.dir/IOS/FS/HostBackend/FS.cpp.o
[335/785] Building CXX object Source/Core/Core/CMakeFiles/core.dir/IOS/DI/DI.cpp.o
[335/785] Building CXX object Source/Core/Core/CMakeFiles/core.dir/IOS/Network/ICMPLin.cpp.o
[336/785] Building CXX object Source/Core/Core/CMakeFiles/core.dir/IOS/Network/ICMPLin.cpp.o
[336/785] Building CXX object Source/Core/Core/CMakeFiles/core.dir/IOS/Network/MACUtils.cpp.o
[337/785] Building CXX object Source/Core/Core/CMakeFiles/core.dir/IOS/ES/TitleContents.cpp.o
[337/785] Building CXX object Source/Core/Core/CMakeFiles/core.dir/IOS/Network/Socket.cpp.o
[338/785] Building CXX object Source/Core/Core/CMakeFiles/core.dir/IOS/ES/TitleInformation.cpp.o
[338/785] Building CXX object Source/Core/Core/CMakeFiles/core.dir/IOS/Network/SSL.cpp.o
[339/785] Building CXX object Source/Core/Core/CMakeFiles/core.dir/HW/WiimoteEmu/WiimoteEmu.cpp.o
[339/785] Building CXX object Source/Core/Core/CMakeFiles/core.dir/IOS/Network/IP/Top.cpp.o
[340/785] Building CXX object Source/Core/Core/CMakeFiles/core.dir/IOS/ES/Identity.cpp.o
[340/785] Building CXX object Source/Core/Core/CMakeFiles/core.dir/IOS/Network/KD/NetKDRequest.cpp.o
[341/785] Building CXX object Source/Core/Core/CMakeFiles/core.dir/IOS/ES/Views.cpp.o
[341/785] Building CXX object Source/Core/Core/CMakeFiles/core.dir/IOS/Network/KD/NetKDTime.cpp.o
[342/785] Building CXX object Source/Core/Core/CMakeFiles/core.dir/IOS/FS/FileSystem.cpp.o
[342/785] Building CXX object Source/Core/Core/CMakeFiles/core.dir/IOS/Network/KD/NWC24Config.cpp.o
[343/785] Building CXX object Source/Core/Core/CMakeFiles/core.dir/IOS/IOSC.cpp.o
[343/785] Building CXX object Source/Core/Core/CMakeFiles/core.dir/IOS/Network/NCD/WiiNetConfig.cpp.o
[344/785] Building CXX object Source/Core/Core/CMakeFiles/core.dir/IOS/Network/MACUtils.cpp.o
[344/785] Building CXX object Source/Core/Core/CMakeFiles/core.dir/IOS/Network/NCD/Manage.cpp.o
[345/785] Building CXX object Source/Core/Core/CMakeFiles/core.dir/HW/WiimoteReal/WiimoteReal.cpp.o
[345/785] Building CXX object Source/Core/Core/CMakeFiles/core.dir/IOS/Network/WD/Command.cpp.o
[346/785] Building CXX object Source/Core/Core/CMakeFiles/core.dir/IOS/ES/ES.cpp.o
[346/785] Building CXX object Source/Core/Core/CMakeFiles/core.dir/IOS/SDIO/SDIOSlot0.cpp.o
[347/785] Building CXX object Source/Core/Core/CMakeFiles/core.dir/IOS/FS/HostBackend/File.cpp.o
[347/785] Building CXX object Source/Core/Core/CMakeFiles/core.dir/IOS/STM/STM.cpp.o
[348/785] Building CXX object Source/Core/Core/CMakeFiles/core.dir/IOS/Network/KD/NetKDTime.cpp.o
[348/785] Building CXX object Source/Core/Core/CMakeFiles/core.dir/IOS/USB/Common.cpp.o
[349/785] Building CXX object Source/Core/Core/CMakeFiles/core.dir/IOS/Network/KD/NWC24Config.cpp.o
[349/785] Building CXX object Source/Core/Core/CMakeFiles/core.dir/IOS/USB/Host.cpp.o
[350/785] Building CXX object Source/Core/Core/CMakeFiles/core.dir/IOS/Network/NCD/WiiNetConfig.cpp.o
[350/785] Building CXX object Source/Core/Core/CMakeFiles/core.dir/IOS/USB/OH0/OH0.cpp.o
[351/785] Building CXX object Source/Core/Core/CMakeFiles/core.dir/IOS/Network/SSL.cpp.o
1019
In file included from ../Source/Core/Core/IOS/Network/Socket.h:27,
1020
                 from ../Source/Core/Core/IOS/Network/SSL.cpp:22:
1021
/usr/include/sys/fcntl.h:1:2: warning: #warning redirecting incorrect #include <sys/fcntl.h> to <fcntl.h> [-Wcpp]
1022
 #warning redirecting incorrect #include <sys/fcntl.h> to <fcntl.h>
1023
  ^~~~~~~
1024
[351/785] Building CXX object Source/Core/Core/CMakeFiles/core.dir/IOS/USB/OH0/OH0Device.cpp.o
[352/785] Building CXX object Source/Core/Core/CMakeFiles/core.dir/IOS/ES/TitleManagement.cpp.o
[352/785] Building CXX object Source/Core/Core/CMakeFiles/core.dir/IOS/USB/USB_HID/HIDv4.cpp.o
[353/785] Building CXX object Source/Core/Core/CMakeFiles/core.dir/IOS/Network/NCD/Manage.cpp.o
[353/785] Building CXX object Source/Core/Core/CMakeFiles/core.dir/IOS/USB/USB_HID/HIDv5.cpp.o
[354/785] Building CXX object Source/Core/Core/CMakeFiles/core.dir/IOS/Network/WD/Command.cpp.o
[354/785] Building CXX object Source/Core/Core/CMakeFiles/core.dir/IOS/USB/USB_VEN/VEN.cpp.o
[355/785] Building CXX object Source/Core/Core/CMakeFiles/core.dir/IOS/ES/Formats.cpp.o
[355/785] Building CXX object Source/Core/Core/CMakeFiles/core.dir/IOS/USB/USBV0.cpp.o
[356/785] Building CXX object Source/Core/Core/CMakeFiles/core.dir/IOS/ES/NandUtils.cpp.o
[356/785] Building CXX object Source/Core/Core/CMakeFiles/core.dir/IOS/USB/USBV4.cpp.o
[357/785] Building CXX object Source/Core/Core/CMakeFiles/core.dir/IOS/Network/Socket.cpp.o
1025
In file included from ../Source/Core/Core/IOS/Network/Socket.h:27,
1026
                 from ../Source/Core/Core/IOS/Network/Socket.cpp:6:
1027
/usr/include/sys/fcntl.h:1:2: warning: #warning redirecting incorrect #include <sys/fcntl.h> to <fcntl.h> [-Wcpp]
1028
 #warning redirecting incorrect #include <sys/fcntl.h> to <fcntl.h>
1029
  ^~~~~~~
1030
[357/785] Building CXX object Source/Core/Core/CMakeFiles/core.dir/IOS/USB/USBV5.cpp.o
[358/785] Building CXX object Source/Core/Core/CMakeFiles/core.dir/IOS/FS/FileSystemProxy.cpp.o
[358/785] Building CXX object Source/Core/Core/CMakeFiles/core.dir/IOS/USB/USB_KBD.cpp.o
[359/785] Building CXX object Source/Core/Core/CMakeFiles/core.dir/IOS/Network/KD/NetKDRequest.cpp.o
1031
In file included from ../Source/Core/Core/IOS/Network/Socket.h:27,
1032
                 from ../Source/Core/Core/IOS/Network/KD/NetKDRequest.cpp:20:
1033
/usr/include/sys/fcntl.h:1:2: warning: #warning redirecting incorrect #include <sys/fcntl.h> to <fcntl.h> [-Wcpp]
1034
 #warning redirecting incorrect #include <sys/fcntl.h> to <fcntl.h>
1035
  ^~~~~~~
1036
[359/785] Building CXX object Source/Core/Core/CMakeFiles/core.dir/IOS/USB/Bluetooth/BTBase.cpp.o
[360/785] Building CXX object Source/Core/Core/CMakeFiles/core.dir/IOS/STM/STM.cpp.o
[360/785] Building CXX object Source/Core/Core/CMakeFiles/core.dir/IOS/USB/Bluetooth/BTEmu.cpp.o
[361/785] Building CXX object Source/Core/Core/CMakeFiles/core.dir/IOS/Network/IP/Top.cpp.o
1037
In file included from ../Source/Core/Core/IOS/Network/Socket.h:27,
1038
                 from ../Source/Core/Core/IOS/Network/IP/Top.cpp:32:
1039
/usr/include/sys/fcntl.h:1:2: warning: #warning redirecting incorrect #include <sys/fcntl.h> to <fcntl.h> [-Wcpp]
1040
 #warning redirecting incorrect #include <sys/fcntl.h> to <fcntl.h>
1041
  ^~~~~~~
1042
../Source/Core/Core/IOS/Network/IP/Top.cpp: In function 'IOS::HLE::Device::DefaultInterface IOS::HLE::Device::GetSystemDefaultInterfaceOrFallback()':
1043
../Source/Core/Core/IOS/Network/IP/Top.cpp:256:11: warning: '<anonymous>' may be used uninitialized in this function [-Wmaybe-uninitialized]
1044
   return {};
1045
           ^
1046
../Source/Core/Core/IOS/Network/IP/Top.cpp:256:11: warning: '*((void*)&<anonymous> +4)' may be used uninitialized in this function [-Wmaybe-uninitialized]
1047
../Source/Core/Core/IOS/Network/IP/Top.cpp:256:11: warning: '*((void*)&<anonymous> +8)' may be used uninitialized in this function [-Wmaybe-uninitialized]
1048
[361/785] Building CXX object Source/Core/Core/CMakeFiles/core.dir/IOS/USB/Bluetooth/BTStub.cpp.o
[362/785] Building CXX object Source/Core/Core/CMakeFiles/core.dir/HW/WiiSave.cpp.o
[362/785] Building CXX object Source/Core/Core/CMakeFiles/core.dir/IOS/USB/Bluetooth/WiimoteDevice.cpp.o
[363/785] Building CXX object Source/Core/Core/CMakeFiles/core.dir/IOS/USB/Common.cpp.o
[363/785] Building CXX object Source/Core/Core/CMakeFiles/core.dir/IOS/USB/Bluetooth/WiimoteHIDAttr.cpp.o
[364/785] Building CXX object Source/Core/Core/CMakeFiles/core.dir/IOS/USB/USBV4.cpp.o
[364/785] Building CXX object Source/Core/Core/CMakeFiles/core.dir/IOS/WFS/WFSSRV.cpp.o
[365/785] Building CXX object Source/Core/Core/CMakeFiles/core.dir/IOS/USB/USB_HID/HIDv5.cpp.o
[365/785] Building CXX object Source/Core/Core/CMakeFiles/core.dir/IOS/WFS/WFSI.cpp.o
[366/785] Building CXX object Source/Core/Core/CMakeFiles/core.dir/IOS/USB/Host.cpp.o
[366/785] Building CXX object Source/Core/Core/CMakeFiles/core.dir/PowerPC/BreakPoints.cpp.o
[367/785] Building CXX object Source/Core/Core/CMakeFiles/core.dir/IOS/USB/OH0/OH0Device.cpp.o
[367/785] Building CXX object Source/Core/Core/CMakeFiles/core.dir/PowerPC/ConditionRegister.cpp.o
[368/785] Building CXX object Source/Core/Core/CMakeFiles/core.dir/IOS/SDIO/SDIOSlot0.cpp.o
[368/785] Building CXX object Source/Core/Core/CMakeFiles/core.dir/PowerPC/JitInterface.cpp.o
[369/785] Building CXX object Source/Core/Core/CMakeFiles/core.dir/IOS/IOS.cpp.o
1049
In file included from ../Source/Core/Core/IOS/Network/Socket.h:27,
1050
                 from ../Source/Core/Core/IOS/IOS.cpp:42:
1051
/usr/include/sys/fcntl.h:1:2: warning: #warning redirecting incorrect #include <sys/fcntl.h> to <fcntl.h> [-Wcpp]
1052
 #warning redirecting incorrect #include <sys/fcntl.h> to <fcntl.h>
1053
  ^~~~~~~
1054
[369/785] Building CXX object Source/Core/Core/CMakeFiles/core.dir/PowerPC/MMU.cpp.o
[370/785] Building CXX object Source/Core/Core/CMakeFiles/core.dir/IOS/USB/USB_VEN/VEN.cpp.o
[370/785] Building CXX object Source/Core/Core/CMakeFiles/core.dir/PowerPC/PowerPC.cpp.o
[371/785] Building CXX object Source/Core/Core/CMakeFiles/core.dir/IOS/USB/USBV0.cpp.o
[371/785] Building CXX object Source/Core/Core/CMakeFiles/core.dir/PowerPC/PPCAnalyst.cpp.o
[372/785] Building CXX object Source/Core/Core/CMakeFiles/core.dir/IOS/USB/Bluetooth/BTBase.cpp.o
[372/785] Building CXX object Source/Core/Core/CMakeFiles/core.dir/PowerPC/PPCCache.cpp.o
[373/785] Building CXX object Source/Core/Core/CMakeFiles/core.dir/IOS/USB/USBV5.cpp.o
[373/785] Building CXX object Source/Core/Core/CMakeFiles/core.dir/PowerPC/PPCSymbolDB.cpp.o
[374/785] Building CXX object Source/Core/Core/CMakeFiles/core.dir/IOS/USB/USB_KBD.cpp.o
1055
../Source/Core/Core/IOS/USB/USB_KBD.cpp: In constructor 'IOS::HLE::Device::USB_KBD::MessageData::MessageData(IOS::HLE::Device::USB_KBD::MessageType, u8, IOS::HLE::Device::USB_KBD::PressedKeyData)':
1056
../Source/Core/Core/IOS/USB/USB_KBD.cpp:179:94: warning: declaration of 'pressed_keys' shadows a member of 'IOS::HLE::Device::USB_KBD::MessageData' [-Wshadow]
1057
 USB_KBD::MessageData::MessageData(MessageType type, u8 modifiers, PressedKeyData pressed_keys)
1058
                                                                                              ^
1059
In file included from ../Source/Core/Core/IOS/USB/USB_KBD.cpp:5:
1060
../Source/Core/Core/IOS/USB/USB_KBD.h:45:33: note: shadowed declaration is here
1061
     PressedKeyData pressed_keys{};
1062
                                 ^
1063
../Source/Core/Core/IOS/USB/USB_KBD.cpp:179:94: warning: declaration of 'modifiers' shadows a member of 'IOS::HLE::Device::USB_KBD::MessageData' [-Wshadow]
1064
 USB_KBD::MessageData::MessageData(MessageType type, u8 modifiers, PressedKeyData pressed_keys)
1065
                                                                                              ^
1066
In file included from ../Source/Core/Core/IOS/USB/USB_KBD.cpp:5:
1067
../Source/Core/Core/IOS/USB/USB_KBD.h:43:20: note: shadowed declaration is here
1068
     u8 modifiers = 0;
1069
                    ^
1070
[374/785] Building CXX object Source/Core/Core/CMakeFiles/core.dir/PowerPC/PPCTables.cpp.o
[375/785] Building CXX object Source/Core/Core/CMakeFiles/core.dir/IOS/USB/OH0/OH0.cpp.o
[375/785] Building CXX object Source/Core/Core/CMakeFiles/core.dir/PowerPC/CachedInterpreter/CachedInterpreter.cpp.o
[376/785] Building CXX object Source/Core/Core/CMakeFiles/core.dir/IOS/USB/USB_HID/HIDv4.cpp.o
[376/785] Building CXX object Source/Core/Core/CMakeFiles/core.dir/PowerPC/CachedInterpreter/InterpreterBlockCache.cpp.o
[377/785] Building CXX object Source/Core/Core/CMakeFiles/core.dir/IOS/USB/Bluetooth/WiimoteHIDAttr.cpp.o
[377/785] Building CXX object Source/Core/Core/CMakeFiles/core.dir/PowerPC/JitCommon/JitAsmCommon.cpp.o
[378/785] Building CXX object Source/Core/Core/CMakeFiles/core.dir/IOS/USB/Bluetooth/BTStub.cpp.o
[378/785] Building CXX object Source/Core/Core/CMakeFiles/core.dir/PowerPC/JitCommon/JitBase.cpp.o
[379/785] Building CXX object Source/Core/Core/CMakeFiles/core.dir/IOS/FS/HostBackend/FS.cpp.o
[379/785] Building CXX object Source/Core/Core/CMakeFiles/core.dir/PowerPC/JitCommon/JitCache.cpp.o
[380/785] Building CXX object Source/Core/Core/CMakeFiles/core.dir/PowerPC/JitCommon/JitAsmCommon.cpp.o
[380/785] Building CXX object Source/Core/Core/CMakeFiles/core.dir/PowerPC/SignatureDB/CSVSignatureDB.cpp.o
[381/785] Building CXX object Source/Core/Core/CMakeFiles/core.dir/IOS/WFS/WFSSRV.cpp.o
[381/785] Building CXX object Source/Core/Core/CMakeFiles/core.dir/PowerPC/SignatureDB/DSYSignatureDB.cpp.o
[382/785] Building CXX object Source/Core/Core/CMakeFiles/core.dir/PowerPC/BreakPoints.cpp.o
[382/785] Building CXX object Source/Core/Core/CMakeFiles/core.dir/PowerPC/SignatureDB/MEGASignatureDB.cpp.o
[383/785] Building CXX object Source/Core/Core/CMakeFiles/core.dir/PowerPC/PPCCache.cpp.o
[383/785] Building CXX object Source/Core/Core/CMakeFiles/core.dir/PowerPC/SignatureDB/SignatureDB.cpp.o
[384/785] Building CXX object Source/Core/Core/CMakeFiles/core.dir/PowerPC/PowerPC.cpp.o
[384/785] Building CXX object Source/Core/Core/CMakeFiles/core.dir/PowerPC/Interpreter/Interpreter_Branch.cpp.o
[385/785] Building CXX object Source/Core/Core/CMakeFiles/core.dir/PowerPC/CachedInterpreter/InterpreterBlockCache.cpp.o
[385/785] Building CXX object Source/Core/Core/CMakeFiles/core.dir/PowerPC/Interpreter/Interpreter.cpp.o
[386/785] Building CXX object Source/Core/Core/CMakeFiles/core.dir/PowerPC/PPCTables.cpp.o
[386/785] Building CXX object Source/Core/Core/CMakeFiles/core.dir/PowerPC/Interpreter/Interpreter_FloatingPoint.cpp.o
[387/785] Building CXX object Source/Core/Core/CMakeFiles/core.dir/PowerPC/ConditionRegister.cpp.o
[387/785] Building CXX object Source/Core/Core/CMakeFiles/core.dir/PowerPC/Interpreter/Interpreter_Integer.cpp.o
[388/785] Building CXX object Source/Core/Core/CMakeFiles/core.dir/IOS/USB/Bluetooth/BTEmu.cpp.o
[388/785] Building CXX object Source/Core/Core/CMakeFiles/core.dir/PowerPC/Interpreter/Interpreter_LoadStore.cpp.o
[389/785] Building CXX object Source/Core/Core/CMakeFiles/core.dir/IOS/USB/Bluetooth/WiimoteDevice.cpp.o
1071
In file included from ../Source/Core/Common/Assert.h:9,
1072
                 from ../Source/Core/Core/IOS/USB/Bluetooth/WiimoteDevice.cpp:12:
1073
../Source/Core/Core/IOS/USB/Bluetooth/WiimoteDevice.cpp: In member function 'void IOS::HLE::WiimoteDevice::EventConnectionAccepted()':
1074
../Source/Core/Core/IOS/USB/Bluetooth/WiimoteDevice.cpp:214:26: warning: format '%x' expects argument of type 'unsigned int', but argument 6 has type 'IOS::HLE::WiimoteDevice::ConnectionState' [-Wformat=]
1075
   DEBUG_LOG(IOS_WIIMOTE, "ConnectionState %x -> CONN_LINKING", m_connection_state);
1076
                          ^~~~~~~~~~~~~~~~~~~~~~~~~~~~~~~~~~~~  ~~~~~~~~~~~~~~~~~~
1077
../Source/Core/Common/Logging/Log.h:97:44: note: in definition of macro 'GENERIC_LOG'
1078
       GenericLog(v, t, __FILE__, __LINE__, __VA_ARGS__);                                           \
1079
                                            ^~~~~~~~~~~
1080
../Source/Core/Core/IOS/USB/Bluetooth/WiimoteDevice.cpp:214:3: note: in expansion of macro 'DEBUG_LOG'
1081
   DEBUG_LOG(IOS_WIIMOTE, "ConnectionState %x -> CONN_LINKING", m_connection_state);
1082
   ^~~~~~~~~
1083
[389/785] Building CXX object Source/Core/Core/CMakeFiles/core.dir/PowerPC/Interpreter/Interpreter_LoadStorePaired.cpp.o
[390/785] Building CXX object Source/Core/Core/CMakeFiles/core.dir/PowerPC/JitInterface.cpp.o
[390/785] Building CXX object Source/Core/Core/CMakeFiles/core.dir/PowerPC/Interpreter/Interpreter_Paired.cpp.o
[391/785] Building CXX object Source/Core/Core/CMakeFiles/core.dir/PowerPC/CachedInterpreter/CachedInterpreter.cpp.o
[391/785] Building CXX object Source/Core/Core/CMakeFiles/core.dir/PowerPC/Interpreter/Interpreter_SystemRegisters.cpp.o
[392/785] Building CXX object Source/Core/Core/CMakeFiles/core.dir/IOS/WFS/WFSI.cpp.o
[392/785] Building CXX object Source/Core/Core/CMakeFiles/core.dir/PowerPC/Interpreter/Interpreter_Tables.cpp.o
[393/785] Building CXX object Source/Core/Core/CMakeFiles/core.dir/PowerPC/MMU.cpp.o
[393/785] Building CXX object Source/Core/Core/CMakeFiles/core.dir/DSP/Jit/x64/DSPEmitter.cpp.o
[394/785] Building CXX object Source/Core/Core/CMakeFiles/core.dir/PowerPC/PPCAnalyst.cpp.o
[394/785] Building CXX object Source/Core/Core/CMakeFiles/core.dir/DSP/Jit/x64/DSPJitArithmetic.cpp.o
[395/785] Building CXX object Source/Core/Core/CMakeFiles/core.dir/PowerPC/PPCSymbolDB.cpp.o
[395/785] Building CXX object Source/Core/Core/CMakeFiles/core.dir/DSP/Jit/x64/DSPJitBranch.cpp.o
[396/785] Building CXX object Source/Core/Core/CMakeFiles/core.dir/PowerPC/JitCommon/JitBase.cpp.o
[396/785] Building CXX object Source/Core/Core/CMakeFiles/core.dir/DSP/Jit/x64/DSPJitCCUtil.cpp.o
[397/785] Building CXX object Source/Core/Core/CMakeFiles/core.dir/PowerPC/Interpreter/Interpreter_Branch.cpp.o
[397/785] Building CXX object Source/Core/Core/CMakeFiles/core.dir/DSP/Jit/x64/DSPJitExtOps.cpp.o
[398/785] Building CXX object Source/Core/Core/CMakeFiles/core.dir/PowerPC/SignatureDB/SignatureDB.cpp.o
[398/785] Building CXX object Source/Core/Core/CMakeFiles/core.dir/DSP/Jit/x64/DSPJitLoadStore.cpp.o
[399/785] Building CXX object Source/Core/Core/CMakeFiles/core.dir/PowerPC/Interpreter/Interpreter_LoadStorePaired.cpp.o
[399/785] Building CXX object Source/Core/Core/CMakeFiles/core.dir/DSP/Jit/x64/DSPJitMisc.cpp.o
[400/785] Building CXX object Source/Core/Core/CMakeFiles/core.dir/PowerPC/SignatureDB/MEGASignatureDB.cpp.o
[400/785] Building CXX object Source/Core/Core/CMakeFiles/core.dir/DSP/Jit/x64/DSPJitMultiplier.cpp.o
[401/785] Building CXX object Source/Core/Core/CMakeFiles/core.dir/PowerPC/Interpreter/Interpreter_LoadStore.cpp.o
[401/785] Building CXX object Source/Core/Core/CMakeFiles/core.dir/DSP/Jit/x64/DSPJitRegCache.cpp.o
[402/785] Building CXX object Source/Core/Core/CMakeFiles/core.dir/PowerPC/JitCommon/JitCache.cpp.o
[402/785] Building CXX object Source/Core/Core/CMakeFiles/core.dir/DSP/Jit/x64/DSPJitTables.cpp.o
[403/785] Building CXX object Source/Core/Core/CMakeFiles/core.dir/PowerPC/Interpreter/Interpreter_Tables.cpp.o
[403/785] Building CXX object Source/Core/Core/CMakeFiles/core.dir/DSP/Jit/x64/DSPJitUtil.cpp.o
[404/785] Building CXX object Source/Core/Core/CMakeFiles/core.dir/PowerPC/SignatureDB/DSYSignatureDB.cpp.o
[404/785] Building CXX object Source/Core/Core/CMakeFiles/core.dir/PowerPC/Jit64/Jit.cpp.o
[405/785] Building CXX object Source/Core/Core/CMakeFiles/core.dir/PowerPC/SignatureDB/CSVSignatureDB.cpp.o
[405/785] Building CXX object Source/Core/Core/CMakeFiles/core.dir/PowerPC/Jit64/Jit64_Tables.cpp.o
[406/785] Building CXX object Source/Core/Core/CMakeFiles/core.dir/PowerPC/Interpreter/Interpreter_Integer.cpp.o
[406/785] Building CXX object Source/Core/Core/CMakeFiles/core.dir/PowerPC/Jit64/Jit_Branch.cpp.o
[407/785] Building CXX object Source/Core/Core/CMakeFiles/core.dir/PowerPC/Interpreter/Interpreter_SystemRegisters.cpp.o
[407/785] Building CXX object Source/Core/Core/CMakeFiles/core.dir/PowerPC/Jit64/Jit_FloatingPoint.cpp.o
[408/785] Building CXX object Source/Core/Core/CMakeFiles/core.dir/PowerPC/Interpreter/Interpreter_FloatingPoint.cpp.o
[408/785] Building CXX object Source/Core/Core/CMakeFiles/core.dir/PowerPC/Jit64/Jit_Integer.cpp.o
[409/785] Building CXX object Source/Core/Core/CMakeFiles/core.dir/PowerPC/Interpreter/Interpreter.cpp.o
[409/785] Building CXX object Source/Core/Core/CMakeFiles/core.dir/PowerPC/Jit64/Jit_LoadStore.cpp.o
[410/785] Building CXX object Source/Core/Core/CMakeFiles/core.dir/DSP/Jit/x64/DSPJitTables.cpp.o
[410/785] Building CXX object Source/Core/Core/CMakeFiles/core.dir/PowerPC/Jit64/Jit_LoadStoreFloating.cpp.o
[411/785] Building CXX object Source/Core/Core/CMakeFiles/core.dir/DSP/Jit/x64/DSPJitCCUtil.cpp.o
[411/785] Building CXX object Source/Core/Core/CMakeFiles/core.dir/PowerPC/Jit64/Jit_LoadStorePaired.cpp.o
[412/785] Building CXX object Source/Core/Core/CMakeFiles/core.dir/DSP/Jit/x64/DSPEmitter.cpp.o
[412/785] Building CXX object Source/Core/Core/CMakeFiles/core.dir/PowerPC/Jit64/Jit_Paired.cpp.o
[413/785] Building CXX object Source/Core/Core/CMakeFiles/core.dir/DSP/Jit/x64/DSPJitMisc.cpp.o
[413/785] Building CXX object Source/Core/Core/CMakeFiles/core.dir/PowerPC/Jit64/Jit_SystemRegisters.cpp.o
[414/785] Building CXX object Source/Core/Core/CMakeFiles/core.dir/DSP/Jit/x64/DSPJitExtOps.cpp.o
[414/785] Building CXX object Source/Core/Core/CMakeFiles/core.dir/PowerPC/Jit64/JitAsm.cpp.o
[415/785] Building CXX object Source/Core/Core/CMakeFiles/core.dir/DSP/Jit/x64/DSPJitArithmetic.cpp.o
[415/785] Building CXX object Source/Core/Core/CMakeFiles/core.dir/PowerPC/Jit64/RegCache/FPURegCache.cpp.o
[416/785] Building CXX object Source/Core/Core/CMakeFiles/core.dir/DSP/Jit/x64/DSPJitMultiplier.cpp.o
[416/785] Building CXX object Source/Core/Core/CMakeFiles/core.dir/PowerPC/Jit64/RegCache/GPRRegCache.cpp.o
[417/785] Building CXX object Source/Core/Core/CMakeFiles/core.dir/DSP/Jit/x64/DSPJitLoadStore.cpp.o
[417/785] Building CXX object Source/Core/Core/CMakeFiles/core.dir/PowerPC/Jit64/RegCache/JitRegCache.cpp.o
[418/785] Building CXX object Source/Core/Core/CMakeFiles/core.dir/DSP/Jit/x64/DSPJitBranch.cpp.o
[418/785] Building CXX object Source/Core/Core/CMakeFiles/core.dir/PowerPC/Jit64Common/BlockCache.cpp.o
[419/785] Building CXX object Source/Core/Core/CMakeFiles/core.dir/DSP/Jit/x64/DSPJitRegCache.cpp.o
[419/785] Building CXX object Source/Core/Core/CMakeFiles/core.dir/PowerPC/Jit64Common/ConstantPool.cpp.o
[420/785] Building CXX object Source/Core/Core/CMakeFiles/core.dir/PowerPC/Jit64/Jit64_Tables.cpp.o
[420/785] Building CXX object Source/Core/Core/CMakeFiles/core.dir/PowerPC/Jit64Common/EmuCodeBlock.cpp.o
[421/785] Building CXX object Source/Core/Core/CMakeFiles/core.dir/DSP/Jit/x64/DSPJitUtil.cpp.o
[421/785] Building CXX object Source/Core/Core/CMakeFiles/core.dir/PowerPC/Jit64Common/FarCodeCache.cpp.o
[422/785] Building CXX object Source/Core/Core/CMakeFiles/core.dir/PowerPC/Interpreter/Interpreter_Paired.cpp.o
[422/785] Building CXX object Source/Core/Core/CMakeFiles/core.dir/PowerPC/Jit64Common/Jit64AsmCommon.cpp.o
[423/785] Building CXX object Source/Core/Core/CMakeFiles/core.dir/PowerPC/Jit64Common/ConstantPool.cpp.o
[423/785] Building CXX object Source/Core/Core/CMakeFiles/core.dir/PowerPC/Jit64Common/TrampolineCache.cpp.o
[424/785] Building CXX object Source/Core/Core/CMakeFiles/core.dir/PowerPC/Jit64/Jit_LoadStore.cpp.o
[424/785] Building CXX object Source/Core/Core/CMakeFiles/core.dir/IOS/USB/LibusbDevice.cpp.o
[425/785] Building CXX object Source/Core/Core/CMakeFiles/core.dir/PowerPC/Jit64/Jit_Branch.cpp.o
[425/785] Building CXX object Source/Core/Core/CMakeFiles/core.dir/IOS/USB/Bluetooth/BTReal.cpp.o
[426/785] Building CXX object Source/Core/Core/CMakeFiles/core.dir/PowerPC/Jit64Common/BlockCache.cpp.o
[426/785] Building CXX object Source/Core/Core/CMakeFiles/core.dir/HW/EXI/BBA-TAP/TAP_Unix.cpp.o
[427/785] Building CXX object Source/Core/Core/CMakeFiles/core.dir/PowerPC/Jit64/Jit_FloatingPoint.cpp.o
[427/785] Building CXX object Source/Core/Core/CMakeFiles/core.dir/HW/WiimoteReal/IOLinux.cpp.o
[428/785] Building CXX object Source/Core/Core/CMakeFiles/core.dir/PowerPC/Jit64/Jit_LoadStorePaired.cpp.o
[428/785] Building CXX object Source/Core/Core/CMakeFiles/core.dir/HW/WiimoteReal/IOhidapi.cpp.o
[429/785] Building CXX object Source/Core/Core/CMakeFiles/core.dir/PowerPC/Jit64Common/FarCodeCache.cpp.o
[429/785] Building CXX object Source/Core/Core/CMakeFiles/core.dir/MemoryWatcher.cpp.o
[430/785] Building CXX object Source/Core/Core/CMakeFiles/core.dir/PowerPC/Jit64/RegCache/GPRRegCache.cpp.o
[430/785] Building CXX object Source/Core/DiscIO/CMakeFiles/discio.dir/Blob.cpp.o
[431/785] Building CXX object Source/Core/Core/CMakeFiles/core.dir/PowerPC/Jit64/RegCache/FPURegCache.cpp.o
[431/785] Building CXX object Source/Core/DiscIO/CMakeFiles/discio.dir/CISOBlob.cpp.o
[432/785] Building CXX object Source/Core/Core/CMakeFiles/core.dir/PowerPC/Jit64/Jit_LoadStoreFloating.cpp.o
[432/785] Building CXX object Source/Core/DiscIO/CMakeFiles/discio.dir/CompressedBlob.cpp.o
[433/785] Building CXX object Source/Core/Core/CMakeFiles/core.dir/PowerPC/Jit64/Jit_Paired.cpp.o
[433/785] Building CXX object Source/Core/DiscIO/CMakeFiles/discio.dir/DirectoryBlob.cpp.o
[434/785] Building CXX object Source/Core/Core/CMakeFiles/core.dir/PowerPC/Jit64/JitAsm.cpp.o
1084
In file included from /usr/include/c++/8.3.0/bits/cxxabi_init_exception.h:38,
1085
                 from /usr/include/c++/8.3.0/bits/exception_ptr.h:38,
1086
                 from /usr/include/c++/8.3.0/exception:143,
1087
                 from /usr/include/c++/8.3.0/new:40,
1088
                 from /usr/include/c++/8.3.0/ext/new_allocator.h:33,
1089
                 from /usr/include/c++/8.3.0/x86_64-alpine-linux-musl/bits/c++allocator.h:33,
1090
                 from /usr/include/c++/8.3.0/bits/allocator.h:46,
1091
                 from /usr/include/c++/8.3.0/unordered_map:40,
1092
                 from ../Source/Core/Core/PowerPC/Jit64Common/EmuCodeBlock.h:7,
1093
                 from ../Source/Core/Core/PowerPC/Jit64Common/Jit64AsmCommon.h:8,
1094
                 from ../Source/Core/Core/PowerPC/Jit64/JitAsm.h:8,
1095
                 from ../Source/Core/Core/PowerPC/Jit64/JitAsm.cpp:5:
1096
../Source/Core/Core/PowerPC/Jit64/JitAsm.cpp: In member function 'void Jit64AsmRoutineManager::Generate()':
1097
../Source/Core/Core/PowerPC/Jit64/JitAsm.cpp:139:69: warning: offsetof within non-standard-layout type 'JitBlock' is conditionally-supported [-Winvalid-offsetof]
1098
     CMP(64, R(RSCRATCH2), MDisp(RSCRATCH, static_cast<s32>(offsetof(JitBlock, effectiveAddress))));
1099
                                                                     ^
1100
../Source/Core/Core/PowerPC/Jit64/JitAsm.cpp:147:54: warning: offsetof within non-standard-layout type 'JitBlock' is conditionally-supported [-Winvalid-offsetof]
1101
     JMPptr(MDisp(RSCRATCH, static_cast<s32>(offsetof(JitBlock, normalEntry))));
1102
                                                      ^
1103
../Source/Core/Core/PowerPC/Jit64/JitAsm.cpp:150:54: warning: offsetof within non-standard-layout type 'JitBlock' is conditionally-supported [-Winvalid-offsetof]
1104
     JMPptr(MDisp(RSCRATCH, static_cast<s32>(offsetof(JitBlock, normalEntry))));
1105
                                                      ^
1106
[434/785] Building CXX object Source/Core/DiscIO/CMakeFiles/discio.dir/DiscExtractor.cpp.o
[435/785] Building CXX object Source/Core/Core/CMakeFiles/core.dir/PowerPC/Jit64/Jit_SystemRegisters.cpp.o
[435/785] Building CXX object Source/Core/DiscIO/CMakeFiles/discio.dir/DiscScrubber.cpp.o
[436/785] Building CXX object Source/Core/DiscIO/CMakeFiles/discio.dir/CISOBlob.cpp.o
[436/785] Building CXX object Source/Core/DiscIO/CMakeFiles/discio.dir/DriveBlob.cpp.o
[437/785] Building CXX object Source/Core/Core/CMakeFiles/core.dir/PowerPC/Jit64/Jit.cpp.o
[437/785] Building CXX object Source/Core/DiscIO/CMakeFiles/discio.dir/Enums.cpp.o
[438/785] Building CXX object Source/Core/Core/CMakeFiles/core.dir/HW/EXI/BBA-TAP/TAP_Unix.cpp.o
[438/785] Building CXX object Source/Core/DiscIO/CMakeFiles/discio.dir/FileBlob.cpp.o
[439/785] Building CXX object Source/Core/Core/CMakeFiles/core.dir/PowerPC/Jit64Common/TrampolineCache.cpp.o
[439/785] Building CXX object Source/Core/DiscIO/CMakeFiles/discio.dir/FileSystemGCWii.cpp.o
[440/785] Building CXX object Source/Core/Core/CMakeFiles/core.dir/PowerPC/Jit64/Jit_Integer.cpp.o
[440/785] Building CXX object Source/Core/DiscIO/CMakeFiles/discio.dir/Filesystem.cpp.o
[441/785] Building CXX object Source/Core/Core/CMakeFiles/core.dir/HW/WiimoteReal/IOLinux.cpp.o
[441/785] Building CXX object Source/Core/DiscIO/CMakeFiles/discio.dir/NANDImporter.cpp.o
[442/785] Building CXX object Source/Core/Core/CMakeFiles/core.dir/PowerPC/Jit64Common/Jit64AsmCommon.cpp.o
[442/785] Building CXX object Source/Core/DiscIO/CMakeFiles/discio.dir/TGCBlob.cpp.o
[443/785] Building CXX object Source/Core/DiscIO/CMakeFiles/discio.dir/Blob.cpp.o
[443/785] Building CXX object Source/Core/DiscIO/CMakeFiles/discio.dir/Volume.cpp.o
[444/785] Building CXX object Source/Core/DiscIO/CMakeFiles/discio.dir/FileBlob.cpp.o
[444/785] Building CXX object Source/Core/DiscIO/CMakeFiles/discio.dir/VolumeFileBlobReader.cpp.o
[445/785] Building CXX object Source/Core/Core/CMakeFiles/core.dir/PowerPC/Jit64/RegCache/JitRegCache.cpp.o
[445/785] Building CXX object Source/Core/DiscIO/CMakeFiles/discio.dir/VolumeGC.cpp.o
[446/785] Building CXX object Source/Core/DiscIO/CMakeFiles/discio.dir/DriveBlob.cpp.o
[446/785] Building CXX object Source/Core/DiscIO/CMakeFiles/discio.dir/VolumeVerifier.cpp.o
[447/785] Building CXX object Source/Core/Core/CMakeFiles/core.dir/HW/WiimoteReal/IOhidapi.cpp.o
[447/785] Building CXX object Source/Core/DiscIO/CMakeFiles/discio.dir/VolumeWad.cpp.o
[448/785] Building CXX object Source/Core/Core/CMakeFiles/core.dir/MemoryWatcher.cpp.o
[448/785] Building CXX object Source/Core/DiscIO/CMakeFiles/discio.dir/VolumeWii.cpp.o
[449/785] Building CXX object Source/Core/DiscIO/CMakeFiles/discio.dir/TGCBlob.cpp.o
[449/785] Building CXX object Source/Core/DiscIO/CMakeFiles/discio.dir/WbfsBlob.cpp.o
[450/785] Building CXX object Source/Core/DiscIO/CMakeFiles/discio.dir/CompressedBlob.cpp.o
[450/785] Building CXX object Source/Core/DiscIO/CMakeFiles/discio.dir/WiiSaveBanner.cpp.o
[451/785] Building CXX object Source/Core/DiscIO/CMakeFiles/discio.dir/Filesystem.cpp.o
[451/785] Building CXX object Source/Core/DiscIO/CMakeFiles/discio.dir/WiiWad.cpp.o
[452/785] Building CXX object Source/Core/Core/CMakeFiles/core.dir/IOS/USB/LibusbDevice.cpp.o
[452/785] Building CXX object Source/Core/InputCommon/CMakeFiles/inputcommon.dir/InputConfig.cpp.o
[453/785] Building CXX object Source/Core/DiscIO/CMakeFiles/discio.dir/DiscScrubber.cpp.o
[453/785] Building CXX object Source/Core/InputCommon/CMakeFiles/inputcommon.dir/InputProfile.cpp.o
[454/785] Building CXX object Source/Core/Core/CMakeFiles/core.dir/PowerPC/Jit64Common/EmuCodeBlock.cpp.o
[454/785] Building CXX object Source/Core/InputCommon/CMakeFiles/inputcommon.dir/ControllerEmu/ControllerEmu.cpp.o
[455/785] Building CXX object Source/Core/DiscIO/CMakeFiles/discio.dir/VolumeFileBlobReader.cpp.o
[455/785] Building CXX object Source/Core/InputCommon/CMakeFiles/inputcommon.dir/ControllerEmu/StickGate.cpp.o
[456/785] Building CXX object Source/Core/DiscIO/CMakeFiles/discio.dir/WiiSaveBanner.cpp.o
[456/785] Building CXX object Source/Core/InputCommon/CMakeFiles/inputcommon.dir/ControllerEmu/Control/Control.cpp.o
[457/785] Building CXX object Source/Core/DiscIO/CMakeFiles/discio.dir/WbfsBlob.cpp.o
[457/785] Building CXX object Source/Core/InputCommon/CMakeFiles/inputcommon.dir/ControllerEmu/Control/Input.cpp.o
[458/785] Building CXX object Source/Core/Core/CMakeFiles/core.dir/IOS/USB/Bluetooth/BTReal.cpp.o
[458/785] Building CXX object Source/Core/InputCommon/CMakeFiles/inputcommon.dir/ControllerEmu/Control/Output.cpp.o
[459/785] Building CXX object Source/Core/DiscIO/CMakeFiles/discio.dir/NANDImporter.cpp.o
[459/785] Building CXX object Source/Core/InputCommon/CMakeFiles/inputcommon.dir/ControllerEmu/ControlGroup/AnalogStick.cpp.o
[460/785] Building CXX object Source/Core/DiscIO/CMakeFiles/discio.dir/FileSystemGCWii.cpp.o
[460/785] Building CXX object Source/Core/InputCommon/CMakeFiles/inputcommon.dir/ControllerEmu/ControlGroup/Attachments.cpp.o
[461/785] Building CXX object Source/Core/DiscIO/CMakeFiles/discio.dir/DiscExtractor.cpp.o
1107
In file included from ../Source/Core/DiscIO/Filesystem.h:15,
1108
                 from ../Source/Core/DiscIO/DiscExtractor.cpp:17:
1109
../Source/Core/DiscIO/Volume.h: In function 'bool DiscIO::ExportTMD(const DiscIO::Volume&, const DiscIO::Partition&, const string&)':
1110
../Source/Core/DiscIO/Volume.h:52:15: warning: '<anonymous>' may be used uninitialized in this function [-Wmaybe-uninitialized]
1111
       return {};
1112
               ^
1113
../Source/Core/DiscIO/Volume.h: In function 'bool DiscIO::ExportCertificateChain(const DiscIO::Volume&, const DiscIO::Partition&, const string&)':
1114
../Source/Core/DiscIO/Volume.h:52:15: warning: '<anonymous>' may be used uninitialized in this function [-Wmaybe-uninitialized]
1115
       return {};
1116
               ^
1117
../Source/Core/DiscIO/Volume.h: In function 'bool DiscIO::ExportApploader(const DiscIO::Volume&, const DiscIO::Partition&, const string&)':
1118
../Source/Core/DiscIO/Volume.h:52:15: warning: '<anonymous>' may be used uninitialized in this function [-Wmaybe-uninitialized]
1119
       return {};
1120
               ^
1121
../Source/Core/DiscIO/Volume.h: In function 'std::optional<unsigned int> DiscIO::GetBootDOLSize(const DiscIO::Volume&, const DiscIO::Partition&, u64)':
1122
../Source/Core/DiscIO/Volume.h:52:15: warning: '<anonymous>' may be used uninitialized in this function [-Wmaybe-uninitialized]
1123
       return {};
1124
               ^
1125
../Source/Core/DiscIO/DiscExtractor.cpp:293:15: warning: '<anonymous>' may be used uninitialized in this function [-Wmaybe-uninitialized]
1126
       return {};
1127
               ^
1128
In file included from ../Source/Core/DiscIO/Filesystem.h:15,
1129
                 from ../Source/Core/DiscIO/DiscExtractor.cpp:17:
1130
../Source/Core/DiscIO/Volume.h:52:15: warning: '<anonymous>' may be used uninitialized in this function [-Wmaybe-uninitialized]
1131
       return {};
1132
               ^
1133
../Source/Core/DiscIO/DiscExtractor.cpp:303:15: warning: '<anonymous>' may be used uninitialized in this function [-Wmaybe-uninitialized]
1134
       return {};
1135
               ^
1136
[461/785] Building CXX object Source/Core/InputCommon/CMakeFiles/inputcommon.dir/ControllerEmu/ControlGroup/Buttons.cpp.o
[462/785] Building CXX object Source/Core/DiscIO/CMakeFiles/discio.dir/WiiWad.cpp.o
1137
In file included from ../Source/Core/DiscIO/WiiWad.cpp:15:
1138
../Source/Core/DiscIO/Blob.h: In member function 'bool DiscIO::WiiWAD::ParseWAD()':
1139
../Source/Core/DiscIO/Blob.h:56:15: warning: '<anonymous>' may be used uninitialized in this function [-Wmaybe-uninitialized]
1140
       return {};
1141
               ^
1142
../Source/Core/DiscIO/Blob.h:56:15: warning: '<anonymous>' may be used uninitialized in this function [-Wmaybe-uninitialized]
1143
       return {};
1144
               ^
1145
../Source/Core/DiscIO/Blob.h:56:15: warning: '<anonymous>' may be used uninitialized in this function [-Wmaybe-uninitialized]
1146
       return {};
1147
               ^
1148
../Source/Core/DiscIO/Blob.h:56:15: warning: '<anonymous>' may be used uninitialized in this function [-Wmaybe-uninitialized]
1149
       return {};
1150
               ^
1151
../Source/Core/DiscIO/Blob.h:56:15: warning: '<anonymous>' may be used uninitialized in this function [-Wmaybe-uninitialized]
1152
       return {};
1153
               ^
1154
../Source/Core/DiscIO/Blob.h:56:15: warning: '<anonymous>' may be used uninitialized in this function [-Wmaybe-uninitialized]
1155
       return {};
1156
               ^
1157
../Source/Core/DiscIO/Blob.h:56:15: warning: '<anonymous>' may be used uninitialized in this function [-Wmaybe-uninitialized]
1158
       return {};
1159
               ^
1160
[462/785] Building CXX object Source/Core/InputCommon/CMakeFiles/inputcommon.dir/ControllerEmu/ControlGroup/ControlGroup.cpp.o
[463/785] Building CXX object Source/Core/DiscIO/CMakeFiles/discio.dir/VolumeWad.cpp.o
1161
In file included from ../Source/Core/DiscIO/VolumeWad.cpp:23:
1162
../Source/Core/DiscIO/Volume.h: In member function 'virtual std::optional<long unsigned int> DiscIO::VolumeWAD::GetTitleID(const DiscIO::Partition&) const':
1163
../Source/Core/DiscIO/Volume.h:52:15: warning: '<anonymous>' may be used uninitialized in this function [-Wmaybe-uninitialized]
1164
       return {};
1165
               ^
1166
[463/785] Building CXX object Source/Core/InputCommon/CMakeFiles/inputcommon.dir/ControllerEmu/ControlGroup/Cursor.cpp.o
[464/785] Building CXX object Source/Core/DiscIO/CMakeFiles/discio.dir/Volume.cpp.o
[464/785] Building CXX object Source/Core/InputCommon/CMakeFiles/inputcommon.dir/ControllerEmu/ControlGroup/Force.cpp.o
[465/785] Building CXX object Source/Core/InputCommon/CMakeFiles/inputcommon.dir/ControllerEmu/Control/Input.cpp.o
[465/785] Building CXX object Source/Core/InputCommon/CMakeFiles/inputcommon.dir/ControllerEmu/ControlGroup/MixedTriggers.cpp.o
[466/785] Building CXX object Source/Core/InputCommon/CMakeFiles/inputcommon.dir/ControllerEmu/Control/Control.cpp.o
[466/785] Building CXX object Source/Core/InputCommon/CMakeFiles/inputcommon.dir/ControllerEmu/ControlGroup/ModifySettingsButton.cpp.o
[467/785] Building CXX object Source/Core/InputCommon/CMakeFiles/inputcommon.dir/ControllerEmu/Control/Output.cpp.o
[467/785] Building CXX object Source/Core/InputCommon/CMakeFiles/inputcommon.dir/ControllerEmu/ControlGroup/Slider.cpp.o
[468/785] Building CXX object Source/Core/DiscIO/CMakeFiles/discio.dir/Enums.cpp.o
[468/785] Building CXX object Source/Core/InputCommon/CMakeFiles/inputcommon.dir/ControllerEmu/ControlGroup/Tilt.cpp.o
[469/785] Building CXX object Source/Core/InputCommon/CMakeFiles/inputcommon.dir/ControllerEmu/ControlGroup/Buttons.cpp.o
[469/785] Building CXX object Source/Core/InputCommon/CMakeFiles/inputcommon.dir/ControllerEmu/ControlGroup/Triggers.cpp.o
[470/785] Building CXX object Source/Core/DiscIO/CMakeFiles/discio.dir/VolumeGC.cpp.o
[470/785] Building CXX object Source/Core/InputCommon/CMakeFiles/inputcommon.dir/ControllerEmu/Setting/NumericSetting.cpp.o
[471/785] Building CXX object Source/Core/InputCommon/CMakeFiles/inputcommon.dir/ControllerEmu/ControlGroup/Attachments.cpp.o
[471/785] Building CXX object Source/Core/InputCommon/CMakeFiles/inputcommon.dir/ControllerInterface/ControllerInterface.cpp.o
[472/785] Building CXX object Source/Core/InputCommon/CMakeFiles/inputcommon.dir/ControllerEmu/ControllerEmu.cpp.o
[472/785] Building CXX object Source/Core/InputCommon/CMakeFiles/inputcommon.dir/ControllerInterface/Device.cpp.o
[473/785] Building CXX object Source/Core/InputCommon/CMakeFiles/inputcommon.dir/ControllerEmu/ControlGroup/AnalogStick.cpp.o
1167
../Source/Core/InputCommon/ControllerEmu/ControlGroup/AnalogStick.cpp: In constructor 'ControllerEmu::OctagonAnalogStick::OctagonAnalogStick(const char*, ControlState)':
1168
../Source/Core/InputCommon/ControllerEmu/ControlGroup/AnalogStick.cpp:59:82: warning: declaration of 'name' shadows a member of 'ControllerEmu::OctagonAnalogStick' [-Wshadow]
1169
 OctagonAnalogStick::OctagonAnalogStick(const char* name, ControlState gate_radius)
1170
                                                                                  ^
1171
In file included from ../Source/Core/InputCommon/ControllerEmu/ControlGroup/AnalogStick.h:7,
1172
                 from ../Source/Core/InputCommon/ControllerEmu/ControlGroup/AnalogStick.cpp:5:
1173
../Source/Core/InputCommon/ControllerEmu/ControlGroup/ControlGroup.h:76:21: note: shadowed declaration is here
1174
   const std::string name;
1175
                     ^~~~
1176
../Source/Core/InputCommon/ControllerEmu/ControlGroup/AnalogStick.cpp: In constructor 'ControllerEmu::OctagonAnalogStick::OctagonAnalogStick(const char*, const char*, ControlState)':
1177
../Source/Core/InputCommon/ControllerEmu/ControlGroup/AnalogStick.cpp:65:64: warning: declaration of 'ui_name' shadows a member of 'ControllerEmu::OctagonAnalogStick' [-Wshadow]
1178
                                        ControlState gate_radius)
1179
                                                                ^
1180
In file included from ../Source/Core/InputCommon/ControllerEmu/ControlGroup/AnalogStick.h:7,
1181
                 from ../Source/Core/InputCommon/ControllerEmu/ControlGroup/AnalogStick.cpp:5:
1182
../Source/Core/InputCommon/ControllerEmu/ControlGroup/ControlGroup.h:77:21: note: shadowed declaration is here
1183
   const std::string ui_name;
1184
                     ^~~~~~~
1185
../Source/Core/InputCommon/ControllerEmu/ControlGroup/AnalogStick.cpp:65:64: warning: declaration of 'name' shadows a member of 'ControllerEmu::OctagonAnalogStick' [-Wshadow]
1186
                                        ControlState gate_radius)
1187
                                                                ^
1188
In file included from ../Source/Core/InputCommon/ControllerEmu/ControlGroup/AnalogStick.h:7,
1189
                 from ../Source/Core/InputCommon/ControllerEmu/ControlGroup/AnalogStick.cpp:5:
1190
../Source/Core/InputCommon/ControllerEmu/ControlGroup/ControlGroup.h:76:21: note: shadowed declaration is here
1191
   const std::string name;
1192
                     ^~~~
1193
[473/785] Building CXX object Source/Core/InputCommon/CMakeFiles/inputcommon.dir/ControlReference/ControlReference.cpp.o
[474/785] Building CXX object Source/Core/InputCommon/CMakeFiles/inputcommon.dir/InputConfig.cpp.o
[474/785] Building CXX object Source/Core/InputCommon/CMakeFiles/inputcommon.dir/ControlReference/ExpressionParser.cpp.o
[475/785] Building CXX object Source/Core/InputCommon/CMakeFiles/inputcommon.dir/InputProfile.cpp.o
[475/785] Building CXX object Source/Core/InputCommon/CMakeFiles/inputcommon.dir/ControllerInterface/Xlib/XInput2.cpp.o
[476/785] Building CXX object Source/Core/InputCommon/CMakeFiles/inputcommon.dir/ControllerEmu/StickGate.cpp.o
1194
../Source/Core/InputCommon/ControllerEmu/StickGate.cpp: In constructor 'ControllerEmu::ReshapableInput::ReshapableInput(std::__cxx11::string, std::__cxx11::string, ControllerEmu::GroupType)':
1195
../Source/Core/InputCommon/ControllerEmu/StickGate.cpp:104:87: warning: declaration of 'type' shadows a member of 'ControllerEmu::ReshapableInput' [-Wshadow]
1196
 ReshapableInput::ReshapableInput(std::string name, std::string ui_name, GroupType type)
1197
                                                                                       ^
1198
In file included from ../Source/Core/InputCommon/ControllerEmu/StickGate.h:13,
1199
                 from ../Source/Core/InputCommon/ControllerEmu/StickGate.cpp:5:
1200
../Source/Core/InputCommon/ControllerEmu/ControlGroup/ControlGroup.h:78:19: note: shadowed declaration is here
1201
   const GroupType type;
1202
                   ^~~~
1203
../Source/Core/InputCommon/ControllerEmu/StickGate.cpp:104:87: warning: declaration of 'ui_name' shadows a member of 'ControllerEmu::ReshapableInput' [-Wshadow]
1204
 ReshapableInput::ReshapableInput(std::string name, std::string ui_name, GroupType type)
1205
                                                                                       ^
1206
In file included from ../Source/Core/InputCommon/ControllerEmu/StickGate.h:13,
1207
                 from ../Source/Core/InputCommon/ControllerEmu/StickGate.cpp:5:
1208
../Source/Core/InputCommon/ControllerEmu/ControlGroup/ControlGroup.h:77:21: note: shadowed declaration is here
1209
   const std::string ui_name;
1210
                     ^~~~~~~
1211
../Source/Core/InputCommon/ControllerEmu/StickGate.cpp:104:87: warning: declaration of 'name' shadows a member of 'ControllerEmu::ReshapableInput' [-Wshadow]
1212
 ReshapableInput::ReshapableInput(std::string name, std::string ui_name, GroupType type)
1213
                                                                                       ^
1214
In file included from ../Source/Core/InputCommon/ControllerEmu/StickGate.h:13,
1215
                 from ../Source/Core/InputCommon/ControllerEmu/StickGate.cpp:5:
1216
../Source/Core/InputCommon/ControllerEmu/ControlGroup/ControlGroup.h:76:21: note: shadowed declaration is here
1217
   const std::string name;
1218
                     ^~~~
1219
[476/785] Building CXX object Source/Core/InputCommon/CMakeFiles/inputcommon.dir/GCAdapter.cpp.o
[477/785] Building CXX object Source/Core/InputCommon/CMakeFiles/inputcommon.dir/ControllerEmu/ControlGroup/MixedTriggers.cpp.o
[477/785] Building CXX object Source/Core/InputCommon/CMakeFiles/inputcommon.dir/ControllerInterface/evdev/evdev.cpp.o
[478/785] Building CXX object Source/Core/InputCommon/CMakeFiles/inputcommon.dir/ControllerEmu/ControlGroup/Slider.cpp.o
[478/785] Building CXX object Source/Core/InputCommon/CMakeFiles/inputcommon.dir/ControllerInterface/Pipes/Pipes.cpp.o
[479/785] Building CXX object Source/Core/InputCommon/CMakeFiles/inputcommon.dir/ControllerEmu/Setting/NumericSetting.cpp.o
[479/785] Building CXX object Source/Core/UICommon/CMakeFiles/uicommon.dir/AutoUpdate.cpp.o
[480/785] Building CXX object Source/Core/InputCommon/CMakeFiles/inputcommon.dir/ControllerEmu/ControlGroup/ModifySettingsButton.cpp.o
[480/785] Building CXX object Source/Core/UICommon/CMakeFiles/uicommon.dir/CommandLineParse.cpp.o
[481/785] Building CXX object Source/Core/InputCommon/CMakeFiles/inputcommon.dir/ControllerEmu/ControlGroup/Triggers.cpp.o
[481/785] Building CXX object Source/Core/UICommon/CMakeFiles/uicommon.dir/Disassembler.cpp.o
[482/785] Building CXX object Source/Core/InputCommon/CMakeFiles/inputcommon.dir/ControlReference/ControlReference.cpp.o
[482/785] Building CXX object Source/Core/UICommon/CMakeFiles/uicommon.dir/DiscordPresence.cpp.o
[483/785] Building CXX object Source/Core/InputCommon/CMakeFiles/inputcommon.dir/ControllerEmu/ControlGroup/Force.cpp.o
[483/785] Building CXX object Source/Core/UICommon/CMakeFiles/uicommon.dir/GameFile.cpp.o
[484/785] Building CXX object Source/Core/InputCommon/CMakeFiles/inputcommon.dir/ControllerEmu/ControlGroup/Cursor.cpp.o
1220
../Source/Core/InputCommon/ControllerEmu/ControlGroup/Cursor.cpp: In constructor 'ControllerEmu::Cursor::Cursor(std::__cxx11::string, std::__cxx11::string)':
1221
../Source/Core/InputCommon/ControllerEmu/ControlGroup/Cursor.cpp:24:53: warning: declaration of 'ui_name' shadows a member of 'ControllerEmu::Cursor' [-Wshadow]
1222
 Cursor::Cursor(std::string name, std::string ui_name)
1223
                                                     ^
1224
In file included from ../Source/Core/InputCommon/ControllerEmu/StickGate.h:13,
1225
                 from ../Source/Core/InputCommon/ControllerEmu/ControlGroup/Cursor.h:10,
1226
                 from ../Source/Core/InputCommon/ControllerEmu/ControlGroup/Cursor.cpp:5:
1227
../Source/Core/InputCommon/ControllerEmu/ControlGroup/ControlGroup.h:77:21: note: shadowed declaration is here
1228
   const std::string ui_name;
1229
                     ^~~~~~~
1230
../Source/Core/InputCommon/ControllerEmu/ControlGroup/Cursor.cpp:24:53: warning: declaration of 'name' shadows a member of 'ControllerEmu::Cursor' [-Wshadow]
1231
 Cursor::Cursor(std::string name, std::string ui_name)
1232
                                                     ^
1233
In file included from ../Source/Core/InputCommon/ControllerEmu/StickGate.h:13,
1234
                 from ../Source/Core/InputCommon/ControllerEmu/ControlGroup/Cursor.h:10,
1235
                 from ../Source/Core/InputCommon/ControllerEmu/ControlGroup/Cursor.cpp:5:
1236
../Source/Core/InputCommon/ControllerEmu/ControlGroup/ControlGroup.h:76:21: note: shadowed declaration is here
1237
   const std::string name;
1238
                     ^~~~
1239
[484/785] Building CXX object Source/Core/UICommon/CMakeFiles/uicommon.dir/GameFileCache.cpp.o
[485/785] Building CXX object Source/Core/InputCommon/CMakeFiles/inputcommon.dir/ControllerEmu/ControlGroup/ControlGroup.cpp.o
[485/785] Building CXX object Source/Core/UICommon/CMakeFiles/uicommon.dir/NetPlayIndex.cpp.o
[486/785] Building CXX object Source/Core/InputCommon/CMakeFiles/inputcommon.dir/ControllerInterface/ControllerInterface.cpp.o
[486/785] Building CXX object Source/Core/UICommon/CMakeFiles/uicommon.dir/ResourcePack/Manager.cpp.o
[487/785] Building CXX object Source/Core/InputCommon/CMakeFiles/inputcommon.dir/ControllerEmu/ControlGroup/Tilt.cpp.o
[487/785] Building CXX object Source/Core/UICommon/CMakeFiles/uicommon.dir/ResourcePack/Manifest.cpp.o
[488/785] Building CXX object Source/Core/DiscIO/CMakeFiles/discio.dir/VolumeWii.cpp.o
1240
In file included from ../Source/Core/DiscIO/VolumeWii.cpp:26:
1241
../Source/Core/DiscIO/Blob.h: In static member function 'static _Res std::_Function_handler<_Res(_ArgTypes ...), _Functor>::_M_invoke(const std::_Any_data&, _ArgTypes&& ...) [with _Res = IOS::ES::TMDReader; _Functor = DiscIO::VolumeWii::VolumeWii(std::unique_ptr<DiscIO::BlobReader>)::<lambda()>; _ArgTypes = {}]':
1242
../Source/Core/DiscIO/Blob.h:56:15: warning: '<anonymous>' may be used uninitialized in this function [-Wmaybe-uninitialized]
1243
       return {};
1244
               ^
1245
../Source/Core/DiscIO/Blob.h: In static member function 'static _Res std::_Function_handler<_Res(_ArgTypes ...), _Functor>::_M_invoke(const std::_Any_data&, _ArgTypes&& ...) [with _Res = std::vector<unsigned char>; _Functor = DiscIO::VolumeWii::VolumeWii(std::unique_ptr<DiscIO::BlobReader>)::<lambda()>; _ArgTypes = {}]':
1246
../Source/Core/DiscIO/Blob.h:56:15: warning: '<anonymous>' may be used uninitialized in this function [-Wmaybe-uninitialized]
1247
       return {};
1248
               ^
1249
[488/785] Building CXX object Source/Core/UICommon/CMakeFiles/uicommon.dir/ResourcePack/ResourcePack.cpp.o
[489/785] Building CXX object Source/Core/InputCommon/CMakeFiles/inputcommon.dir/ControllerInterface/Xlib/XInput2.cpp.o
[489/785] Building CXX object Source/Core/UICommon/CMakeFiles/uicommon.dir/UICommon.cpp.o
[490/785] Building CXX object Source/Core/InputCommon/CMakeFiles/inputcommon.dir/ControllerInterface/Device.cpp.o
[490/785] Building CXX object Source/Core/UICommon/CMakeFiles/uicommon.dir/USBUtils.cpp.o
[491/785] Building CXX object Source/Core/DiscIO/CMakeFiles/discio.dir/VolumeVerifier.cpp.o
[491/785] Building CXX object Source/Core/UICommon/CMakeFiles/uicommon.dir/VideoUtils.cpp.o
[492/785] Building CXX object Source/Core/InputCommon/CMakeFiles/inputcommon.dir/GCAdapter.cpp.o
[492/785] Building CXX object Source/Core/UICommon/CMakeFiles/uicommon.dir/X11Utils.cpp.o
[493/785] Building CXX object Source/Core/UICommon/CMakeFiles/uicommon.dir/Disassembler.cpp.o
[493/785] Building CXX object Source/Core/VideoCommon/CMakeFiles/videocommon.dir/AbstractFramebuffer.cpp.o
[494/785] Building CXX object Source/Core/UICommon/CMakeFiles/uicommon.dir/AutoUpdate.cpp.o
[494/785] Building CXX object Source/Core/VideoCommon/CMakeFiles/videocommon.dir/AbstractStagingTexture.cpp.o
[495/785] Building CXX object Source/Core/UICommon/CMakeFiles/uicommon.dir/DiscordPresence.cpp.o
[495/785] Building CXX object Source/Core/VideoCommon/CMakeFiles/videocommon.dir/AbstractTexture.cpp.o
[496/785] Building CXX object Source/Core/UICommon/CMakeFiles/uicommon.dir/VideoUtils.cpp.o
[496/785] Building CXX object Source/Core/VideoCommon/CMakeFiles/videocommon.dir/AsyncRequests.cpp.o
[497/785] Building CXX object Source/Core/UICommon/CMakeFiles/uicommon.dir/X11Utils.cpp.o
[497/785] Building CXX object Source/Core/VideoCommon/CMakeFiles/videocommon.dir/AsyncShaderCompiler.cpp.o
[498/785] Building CXX object Source/Core/InputCommon/CMakeFiles/inputcommon.dir/ControllerInterface/Pipes/Pipes.cpp.o
[498/785] Building CXX object Source/Core/VideoCommon/CMakeFiles/videocommon.dir/BoundingBox.cpp.o
[499/785] Building CXX object Source/Core/VideoCommon/CMakeFiles/videocommon.dir/AbstractFramebuffer.cpp.o
[499/785] Building CXX object Source/Core/VideoCommon/CMakeFiles/videocommon.dir/BPFunctions.cpp.o
[500/785] Building CXX object Source/Core/InputCommon/CMakeFiles/inputcommon.dir/ControllerInterface/evdev/evdev.cpp.o
[500/785] Building CXX object Source/Core/VideoCommon/CMakeFiles/videocommon.dir/BPMemory.cpp.o
[501/785] Building CXX object Source/Core/UICommon/CMakeFiles/uicommon.dir/UICommon.cpp.o
1250
FAILED: Source/Core/UICommon/CMakeFiles/uicommon.dir/UICommon.cpp.o 
1251
/usr/bin/c++  -DDATA_DIR=\"/usr/share/dolphin-emu/\" -DHAVE_EGL=1 -DHAVE_FFMPEG -DHAVE_LIBEVDEV=1 -DHAVE_LIBUDEV=1 -DHAVE_X11=1 -DHAVE_XRANDR=0 -DUSE_ANALYTICS=1 -DUSE_MEMORYWATCHER=1 -DUSE_PIPES=1 -DUSE_UPNP -D_ARCH_64=1 -D_DEFAULT_SOURCE -D_FILE_OFFSET_BITS=64 -D_LARGEFILE_SOURCE -D_M_X86=1 -D_M_X86_64=1 -D__LIBUSB__ -D__STDC_CONSTANT_MACROS -D__STDC_LIMIT_MACROS -I../Source/Core -I../Externals/enet/include -I../External/minizip -I/usr/include/libpng16 -I../Externals -I/usr/include/libusb-1.0 -ISource/Core -I../Externals/fmt/include -I../Externals/cpp-optparse/. -I../Externals/minizip/. -I../Externals/Bochs_disasm -Os -fomit-frame-pointer -O2 -g -DNDEBUG   -msse2 -fdiagnostics-color -Wall -Wtype-limits -Wsign-compare -Wignored-qualifiers -Wuninitialized -Wlogical-op -Wshadow -Winit-self -Wmissing-declarations -fno-strict-aliasing -fno-exceptions -fvisibility-inlines-hidden -fvisibility=hidden -fomit-frame-pointer -std=c++17 -MD -MT Source/Core/UICommon/CMakeFiles/uicommon.dir/UICommon.cpp.o -MF Source/Core/UICommon/CMakeFiles/uicommon.dir/UICommon.cpp.o.d -o Source/Core/UICommon/CMakeFiles/uicommon.dir/UICommon.cpp.o -c ../Source/Core/UICommon/UICommon.cpp
1252
../Source/Core/UICommon/UICommon.cpp:371:24: error: variable or field 'EnableScreenSaver' declared void
1253
 void EnableScreenSaver(Window win, bool enable)
1254
                        ^~~~~~
1255
../Source/Core/UICommon/UICommon.cpp:371:24: error: 'Window' was not declared in this scope
1256
../Source/Core/UICommon/UICommon.cpp:371:24: note: suggested alternative: 'rindex'
1257
 void EnableScreenSaver(Window win, bool enable)
1258
                        ^~~~~~
1259
                        rindex
1260
../Source/Core/UICommon/UICommon.cpp:371:36: error: expected primary-expression before 'bool'
1261
 void EnableScreenSaver(Window win, bool enable)
1262
                                    ^~~~
1263
[502/785] Building CXX object Source/Core/VideoCommon/CMakeFiles/videocommon.dir/AbstractStagingTexture.cpp.o
[503/785] Building CXX object Source/Core/InputCommon/CMakeFiles/inputcommon.dir/ControlReference/ExpressionParser.cpp.o
[504/785] Building CXX object Source/Core/UICommon/CMakeFiles/uicommon.dir/GameFileCache.cpp.o
[505/785] Building CXX object Source/Core/UICommon/CMakeFiles/uicommon.dir/USBUtils.cpp.o
[506/785] Building CXX object Source/Core/UICommon/CMakeFiles/uicommon.dir/CommandLineParse.cpp.o
[507/785] Building CXX object Source/Core/VideoCommon/CMakeFiles/videocommon.dir/BoundingBox.cpp.o
[508/785] Building CXX object Source/Core/VideoCommon/CMakeFiles/videocommon.dir/BPMemory.cpp.o
[509/785] Building CXX object Source/Core/UICommon/CMakeFiles/uicommon.dir/ResourcePack/ResourcePack.cpp.o
[510/785] Building CXX object Source/Core/DiscIO/CMakeFiles/discio.dir/DirectoryBlob.cpp.o
1264
../Source/Core/DiscIO/DirectoryBlob.cpp: In member function 'void DiscIO::DirectoryBlobReader::SetWiiRegionData(const string&)':
1265
../Source/Core/DiscIO/DirectoryBlob.cpp:454:17: warning: unused variable 'WII_REGION_DATA_SIZE' [-Wunused-variable]
1266
   constexpr u64 WII_REGION_DATA_SIZE = 0x20;
1267
                 ^~~~~~~~~~~~~~~~~~~~
1268
../Source/Core/DiscIO/DirectoryBlob.cpp: In function 'std::optional<DiscIO::PartitionType> DiscIO::ParsePartitionDirectoryName(const string&)':
1269
../Source/Core/DiscIO/DirectoryBlob.cpp:204:11: warning: '<anonymous>' may be used uninitialized in this function [-Wmaybe-uninitialized]
1270
   return {};
1271
           ^
1272
[511/785] Building CXX object Source/Core/VideoCommon/CMakeFiles/videocommon.dir/AbstractTexture.cpp.o
[512/785] Building CXX object Source/Core/UICommon/CMakeFiles/uicommon.dir/ResourcePack/Manager.cpp.o
[513/785] Building CXX object Source/Core/UICommon/CMakeFiles/uicommon.dir/ResourcePack/Manifest.cpp.o
[514/785] Building CXX object Source/Core/VideoCommon/CMakeFiles/videocommon.dir/AsyncShaderCompiler.cpp.o
[515/785] Building CXX object Source/Core/VideoCommon/CMakeFiles/videocommon.dir/AsyncRequests.cpp.o
[516/785] Building CXX object Source/Core/VideoCommon/CMakeFiles/videocommon.dir/BPFunctions.cpp.o
[517/785] Building CXX object Source/Core/UICommon/CMakeFiles/uicommon.dir/GameFile.cpp.o
[518/785] Building CXX object Source/Core/UICommon/CMakeFiles/uicommon.dir/NetPlayIndex.cpp.o
1273
ninja: build stopped: subcommand failed.
1274
>>> ERROR: dolphin-emu: build failed
1275
]0;>>> dolphin-emu: Uninstalling dependencies...
1276
WARNING: Ignoring /home/builder/packages/main/x86_64/APKINDEX.tar.gz: No such file or directory
1277
WARNING: Ignoring /home/builder/packages/community/x86_64/APKINDEX.tar.gz: No such file or directory
1278
(1/204) Purging .makedepends-dolphin-emu (20190627.182956)
1279
7  0%                                             8(2/204) Purging cmake (3.14.5-r0)
1280
7  0%                                             8(3/204) Purging ninja (1.9.0-r1)
1281
7  0%                                             8(4/204) Purging ffmpeg-dev (4.1.3-r1)
1282
7  1%                                             8(5/204) Purging ffmpeg-libs (4.1.3-r1)
1283
7  1%                                             8(6/204) Purging libevdev-dev (1.6.0-r0)
1284
7  2% #                                           8(7/204) Purging eudev-dev (3.2.8-r0)
1285
7  2% #                                           8(8/204) Purging eudev-openrc (3.2.8-r0)
1286
7  3% #                                           8(9/204) Purging eudev (3.2.8-r0)
1287
7  3% #                                           8(10/204) Purging udev-init-scripts-openrc (32-r2)
1288
7  4% #                                           8(11/204) Purging udev-init-scripts (32-r2)
1289
7  4% ##                                          8(12/204) Purging pugixml-dev (1.9-r0)
1290
7  5% ##                                          8(13/204) Purging pugixml (1.9-r0)
1291
7  5% ##                                          8(14/204) Purging lzo-dev (2.10-r2)
1292
7  6% ##                                          8(15/204) Purging lzo (2.10-r2)
1293
7  6% ###                                         8(16/204) Purging sfml-dev (2.5.1-r0)
1294
7  7% ###                                         8(17/204) Purging sfml (2.5.1-r0)
1295
7  7% ###                                         8(18/204) Purging libusb-dev (1.0.22-r1)
1296
7  8% ###                                         8(19/204) Purging miniupnpc-dev (2.1.20190625-r0)
1297
7  8% ###                                         8(20/204) Purging miniupnpc (2.1.20190625-r0)
1298
7  9% ####                                        8(21/204) Purging mbedtls-dev (2.16.2-r0)
1299
7  9% ####                                        8(22/204) Purging mbedtls (2.16.2-r0)
1300
7 10% ####                                        8(23/204) Purging curl-dev (7.65.1-r0)
1301
7 10% ####                                        8(24/204) Purging nghttp2-dev (1.39.1-r0)
1302
7 11% ####                                        8(25/204) Purging hidapi-dev (0.9.0-r2)
1303
7 11% #####                                       8(26/204) Purging hidapi (0.9.0-r2)
1304
7 12% #####                                       8(27/204) Purging qt5-qtbase-dev (5.12.4-r1)
1305
7 12% #####                                       8(28/204) Purging mesa-dev (19.1.1-r0)
1306
7 13% #####                                       8(29/204) Purging libxshmfence-dev (1.3-r0)
1307
7 13% ######                                      8(30/204) Purging mesa-gles (19.1.1-r0)
1308
7 14% ######                                      8(31/204) Purging mesa-osmesa (19.1.1-r0)
1309
7 14% ######                                      8(32/204) Purging mesa-xatracker (19.1.1-r0)
1310
7 15% ######                                      8(33/204) Purging libsm-dev (1.2.3-r0)
1311
7 15% ######                                      8(34/204) Purging openssl-dev (1.1.1c-r0)
1312
7 16% #######                                     8(35/204) Purging fontconfig-dev (2.13.1-r0)
1313
7 16% #######                                     8(36/204) Purging freetype-dev (2.10.0-r0)
1314
7 17% #######                                     8(37/204) Purging libpng-dev (1.6.37-r1)
1315
7 17% #######                                     8(38/204) Purging sqlite-dev (3.28.0-r0)
1316
7 18% #######                                     8(39/204) Purging dbus-dev (1.12.16-r0)
1317
7 18% ########                                    8(40/204) Purging qt5-qtbase-sqlite (5.12.4-r1)
1318
7 19% ########                                    8(41/204) Purging qt5-qtbase-odbc (5.12.4-r1)
1319
7 19% ########                                    8(42/204) Purging qt5-qtbase-postgresql (5.12.4-r1)
1320
7 20% ########                                    8(43/204) Purging qt5-qtbase-mysql (5.12.4-r1)
1321
7 20% #########                                   8(44/204) Purging qt5-qtbase-tds (5.12.4-r1)
1322
7 21% #########                                   8(45/204) Purging qt5-qtbase-x11 (5.12.4-r1)
1323
7 21% #########                                   8(46/204) Purging hicolor-icon-theme (0.17-r1)
1324
7 22% #########                                   8(47/204) Purging libxi-dev (1.7.10-r0)
1325
7 22% #########                                   8(48/204) Purging libxi (1.7.10-r0)
1326
7 23% ##########                                  8(49/204) Purging bluez-dev (5.50-r3)
1327
7 23% ##########                                  8(50/204) Purging bluez-libs (5.50-r3)
1328
7 24% ##########                                  8(51/204) Purging pulseaudio-dev (12.2-r3)
1329
7 24% ##########                                  8(52/204) Purging libpulse-mainloop-glib (12.2-r3)
1330
7 25% ###########                                 8(53/204) Purging libpulse (12.2-r3)
1331
7 25% ###########                                 8(54/204) Purging kmod-openrc (24-r1)
1332
7 25% ###########                                 8(55/204) Purging git-perl (2.22.0-r0)
1333
7 26% ###########                                 8(56/204) Purging perl-git (2.22.0-r0)
1334
7 26% ###########                                 8(57/204) Purging perl-error (0.17027-r0)
1335
7 27% ############                                8(58/204) Purging perl (5.28.2-r1)
1336
7 27% ############                                8(59/204) Purging libarchive (3.3.3-r0)
1337
7 28% ############                                8(60/204) Purging libacl (2.2.52-r6)
1338
7 28% ############                                8(61/204) Purging glib-dev (2.60.4-r0)
1339
7 29% ############                                8(62/204) Purging python3 (3.7.3-r0)
1340
7 29% #############                               8(63/204) Purging gettext-dev (0.19.8.1-r4)
1341
7 30% #############                               8(64/204) Purging gettext-asprintf (0.19.8.1-r4)
1342
7 30% #############                               8(65/204) Purging gettext-libs (0.19.8.1-r4)
1343
7 31% #############                               8(66/204) Purging gettext (0.19.8.1-r4)
1344
7 31% ##############                              8(67/204) Purging docbook-xsl (1.79.1-r1)
1345
7 32% ##############                              8Executing docbook-xsl-1.79.1-r1.post-deinstall
1346
(68/204) Purging libxslt (1.1.33-r1)
1347
7 32% ##############                              8(69/204) Purging docbook-xml (4.5-r6)
1348
7 33% ##############                              8Executing docbook-xml-4.5-r6.post-deinstall
1349
(70/204) Purging libxml2-utils (2.9.9-r2)
1350
7 33% ##############                              8(71/204) Purging bzip2-dev (1.0.6-r6)
1351
7 34% ###############                             8(72/204) Purging harfbuzz (2.5.2-r0)
1352
7 34% ###############                             8(73/204) Purging libass (0.14.0-r0)
1353
7 35% ###############                             8(74/204) Purging fontconfig (2.13.1-r0)
1354
7 35% ###############                             8(75/204) Purging freetype (2.10.0-r0)
1355
7 36% ###############                             8(76/204) Purging libbz2 (1.0.6-r6)
1356
7 36% ################                            8(77/204) Purging lz4-libs (1.9.1-r0)
1357
7 37% ################                            8(78/204) Purging kmod (24-r1)
1358
7 37% ################                            8(79/204) Purging xz-libs (5.2.4-r0)
1359
7 38% ################                            8(80/204) Purging lame (3.100-r0)
1360
7 38% #################                           8(81/204) Purging freetds (1.1.6-r0)
1361
7 39% #################                           8(82/204) Purging unixodbc (2.3.7-r1)
1362
7 39% #################                           8(83/204) Purging readline (8.0.0-r0)
1363
7 40% #################                           8(84/204) Purging ncurses-libs (6.1_p20190518-r0)
1364
7 40% #################                           8(85/204) Purging ncurses-terminfo (6.1_p20190518-r0)
1365
7 41% ##################                          8(86/204) Purging ncurses-terminfo-base (6.1_p20190518-r0)
1366
7 41% ##################                          8(87/204) Purging rhash-libs (1.3.8-r0)
1367
7 42% ##################                          8(88/204) Purging libuv (1.29.1-r0)
1368
7 42% ##################                          8(89/204) Purging libdrm-dev (2.4.98-r0)
1369
7 43% ##################                          8(90/204) Purging libffi-dev (3.2.1-r6)
1370
7 43% ###################                         8(91/204) Purging linux-headers (4.19.36-r0)
1371
7 44% ###################                         8(92/204) Purging mesa-gl (19.1.1-r0)
1372
7 44% ###################                         8(93/204) Purging libva (2.4.1-r0)
1373
7 45% ###################                         8(94/204) Purging mesa-egl (19.1.1-r0)
1374
7 45% ####################                        8(95/204) Purging mesa-gbm (19.1.1-r0)
1375
7 46% ####################                        8(96/204) Purging mesa (19.1.1-r0)
1376
7 46% ####################                        8(97/204) Purging libdrm (2.4.98-r0)
1377
7 47% ####################                        8(98/204) Purging libpciaccess (0.14-r0)
1378
7 47% ####################                        8(99/204) Purging libxxf86vm-dev (1.1.4-r2)
1379
7 48% #####################                       8(100/204) Purging libxxf86vm (1.1.4-r2)
1380
7 48% #####################                       8(101/204) Purging libxdamage-dev (1.1.5-r0)
1381
7 49% #####################                       8(102/204) Purging libxdamage (1.1.5-r0)
1382
7 49% #####################                       8(103/204) Purging libxfixes-dev (5.0.3-r2)
1383
7 50% ######################                      8(104/204) Purging libxfixes (5.0.3-r2)
1384
7 50% ######################                      8(105/204) Purging libxext-dev (1.3.4-r0)
1385
7 50% ######################                      8(106/204) Purging libx11-dev (1.6.8-r0)
1386
7 51% ######################                      8(107/204) Purging xtrans (1.4.0-r0)
1387
7 51% ######################                      8(108/204) Purging libxcb-dev (1.13.1-r0)
1388
7 52% #######################                     8(109/204) Purging xcb-proto (1.13-r3)
1389
7 52% #######################                     8(110/204) Purging libxau-dev (1.0.9-r0)
1390
7 53% #######################                     8(111/204) Purging xcb-util-renderutil (0.3.9-r1)
1391
7 53% #######################                     8(112/204) Purging xcb-util-image (0.4.0-r1)
1392
7 54% #######################                     8(113/204) Purging libxkbcommon-x11 (0.8.4-r0)
1393
7 54% ########################                    8(114/204) Purging xcb-util-wm (0.4.1-r1)
1394
7 55% ########################                    8(115/204) Purging libvdpau (1.2-r0)
1395
7 55% ########################                    8(116/204) Purging libxrandr (1.5.2-r0)
1396
7 56% ########################                    8(117/204) Purging libxext (1.3.4-r0)
1397
7 56% #########################                   8(118/204) Purging libxrender (0.9.10-r3)
1398
7 57% #########################                   8(119/204) Purging libx11 (1.6.8-r0)
1399
7 57% #########################                   8(120/204) Purging xcb-util-keysyms (0.4.0-r1)
1400
7 58% #########################                   8(121/204) Purging xcb-util (0.4.0-r1)
1401
7 58% #########################                   8(122/204) Purging libxcb (1.13.1-r0)
1402
7 59% ##########################                  8(123/204) Purging libxau (1.0.9-r0)
1403
7 59% ##########################                  8(124/204) Purging libice-dev (1.0.9-r3)
1404
7 60% ##########################                  8(125/204) Purging libxdmcp-dev (1.1.3-r0)
1405
7 60% ##########################                  8(126/204) Purging libxdmcp (1.1.3-r0)
1406
7 61% ##########################                  8(127/204) Purging xorgproto (2018.4-r0)
1407
7 61% ###########################                 8(128/204) Purging libbsd (0.9.1-r0)
1408
7 62% ###########################                 8(129/204) Purging libpthread-stubs (0.3-r5)
1409
7 62% ###########################                 8(130/204) Purging libxshmfence (1.3-r0)
1410
7 63% ###########################                 8(131/204) Purging qt5-qtbase (5.12.4-r1)
1411
7 63% ############################                8(132/204) Purging glib (2.60.4-r0)
1412
7 64% ############################                8(133/204) Purging llvm8-libs (8.0.0-r1)
1413
7 64% ############################                8(134/204) Purging wayland-libs-client (1.17.0-r0)
1414
7 65% ############################                8(135/204) Purging cups-libs (2.2.11-r0)
1415
7 65% ############################                8(136/204) Purging gnutls (3.6.8-r0)
1416
7 66% #############################               8(137/204) Purging p11-kit (0.23.16.1-r0)
1417
7 66% #############################               8(138/204) Purging wayland-libs-server (1.17.0-r0)
1418
7 67% #############################               8(139/204) Purging libffi (3.2.1-r6)
1419
7 67% #############################               8(140/204) Purging mesa-glapi (19.1.1-r0)
1420
7 68% #############################               8(141/204) Purging libxml2 (2.9.9-r2)
1421
7 68% ##############################              8(142/204) Purging sdl2 (2.0.9-r0)
1422
7 69% ##############################              8(143/204) Purging openal-soft-dev (1.19.1-r1)
1423
7 69% ##############################              8(144/204) Purging openal-soft (1.19.1-r1)
1424
7 70% ##############################              8(145/204) Purging alsa-lib-dev (1.1.9-r0)
1425
7 70% ###############################             8(146/204) Purging libsndfile (1.0.28-r8)
1426
7 71% ###############################             8(147/204) Purging alsa-lib (1.1.9-r0)
1427
7 71% ###############################             8(148/204) Purging libpng (1.6.37-r1)
1428
7 72% ###############################             8(149/204) Purging util-linux-dev (2.33.2-r0)
1429
7 72% ###############################             8(150/204) Purging libfdisk (2.33.2-r0)
1430
7 73% ################################            8(151/204) Purging libmount (2.33.2-r0)
1431
7 73% ################################            8(152/204) Purging libsmartcols (2.33.2-r0)
1432
7 74% ################################            8(153/204) Purging libblkid (2.33.2-r0)
1433
7 74% ################################            8(154/204) Purging libsm (1.2.3-r0)
1434
7 75% #################################           8(155/204) Purging libuuid (2.33.2-r0)
1435
7 75% #################################           8(156/204) Purging fribidi (1.0.5-r1)
1436
7 75% #################################           8(157/204) Purging nettle (3.4.1-r1)
1437
7 76% #################################           8(158/204) Purging libtasn1 (4.13-r0)
1438
7 76% #################################           8(159/204) Purging libunistring (0.9.10-r0)
1439
7 77% ##################################          8(160/204) Purging opus (1.3.1-r0)
1440
7 77% ##################################          8(161/204) Purging libvorbis-dev (1.3.6-r2)
1441
7 78% ##################################          8(162/204) Purging libvorbis (1.3.6-r2)
1442
7 78% ##################################          8(163/204) Purging flac-dev (1.3.2-r2)
1443
7 79% ##################################          8(164/204) Purging flac (1.3.2-r2)
1444
7 79% ###################################         8(165/204) Purging libogg-dev (1.3.3-r2)
1445
7 80% ###################################         8(166/204) Purging libtheora (1.1.1-r14)
1446
7 80% ###################################         8(167/204) Purging libogg (1.3.3-r2)
1447
7 81% ###################################         8(168/204) Purging v4l-utils-libs (1.16.6-r0)
1448
7 81% ####################################        8(169/204) Purging libjpeg-turbo (2.0.2-r0)
1449
7 82% ####################################        8(170/204) Purging libvpx (1.8.0-r0)
1450
7 82% ####################################        8(171/204) Purging x264-libs (20180304-r1)
1451
7 83% ####################################        8(172/204) Purging x265-libs (3.0-r0)
1452
7 83% ####################################        8(173/204) Purging xvidcore (1.3.4-r1)
1453
7 84% #####################################       8(174/204) Purging libinput-libs (1.13.2-r0)
1454
7 84% #####################################       8(175/204) Purging libevdev (1.6.0-r0)
1455
7 85% #####################################       8(176/204) Purging eudev-libs (3.2.8-r0)
1456
7 85% #####################################       8(177/204) Purging zlib-dev (1.2.11-r1)
1457
7 86% #####################################       8(178/204) Purging libusb (1.0.22-r1)
1458
7 86% ######################################      8(179/204) Purging libice (1.0.9-r3)
1459
7 87% ######################################      8(180/204) Purging expat-dev (2.2.7-r0)
1460
7 87% ######################################      8(181/204) Purging gdbm (1.13-r1)
1461
7 88% ######################################      8(182/204) Purging sqlite-libs (3.28.0-r0)
1462
7 88% #######################################     8(183/204) Purging avahi-libs (0.7-r1)
1463
7 89% #######################################     8(184/204) Purging libintl (0.19.8.1-r4)
1464
7 89% #######################################     8(185/204) Purging libgcrypt (1.8.4-r1)
1465
7 90% #######################################     8(186/204) Purging libgpg-error (1.36-r2)
1466
7 90% #######################################     8(187/204) Purging pcre-dev (8.43-r0)
1467
7 91% ########################################    8(188/204) Purging libpcre16 (8.43-r0)
1468
7 91% ########################################    8(189/204) Purging libpcre32 (8.43-r0)
1469
7 92% ########################################    8(190/204) Purging libpcrecpp (8.43-r0)
1470
7 92% ########################################    8(191/204) Purging pcre (8.43-r0)
1471
7 93% ########################################    8(192/204) Purging dbus-libs (1.12.16-r0)
1472
7 93% #########################################   8(193/204) Purging icu-libs (64.2-r0)
1473
7 94% #########################################   8(194/204) Purging libpcre2-16 (10.33-r0)
1474
7 94% #########################################   8(195/204) Purging libpq (11.3-r2)
1475
7 95% #########################################   8(196/204) Purging libldap (2.4.47-r2)
1476
7 95% ##########################################  8(197/204) Purging libsasl (2.1.27-r3)
1477
7 96% ##########################################  8(198/204) Purging db (5.3.28-r1)
1478
7 96% ##########################################  8(199/204) Purging mariadb-connector-c (3.0.10-r0)
1479
7 97% ##########################################  8(200/204) Purging graphite2 (1.3.13-r1)
1480
7 97% ##########################################  8(201/204) Purging mtdev (1.1.5-r2)
1481
7 98% ########################################### 8(202/204) Purging libxkbcommon (0.8.4-r0)
1482
7 98% ########################################### 8(203/204) Purging libltdl (2.4.6-r6)
1483
7 99% ########################################### 8(204/204) Purging speexdsp (1.2.0-r0)
1484
7 99% ########################################### 87100% ############################################8Executing busybox-1.30.1-r2.trigger
1485
OK: 185 MiB in 54 packages